{"text_format":"1","workbook":"xlsx","n_sheets":11,"sheets":["0a","0b","1","2","3","4","větrnéoblasti","db","rozmístěníhmoždinek","počtyhmoždinek","param"],"not_rendered":{"charts":0,"images":25,"macros":1,"external_links":0,"defined_names":98,"comments":5,"pivot_tables":0},"unopened":[],"bounds":{"document_bytes":16777216,"sheet_cells":100000,"rows_first":2000,"rows_last":500,"rows_between":2000,"halvings":0,"cell_chars":16384,"cell_head_chars":4096},"cells_cut":0,"cells_raw":0,"read":"whole","date_system":"1900"}

{"sheet":"0a","index":0,"n_rows":22,"n_cols":21,"rows_kept":22,"cut":false,"hidden":false,"merged":[[2,9,2,15]]}
[]
[]
[null,null,null,null,null,null,null,null,null,"Cech pro zateplování budov ČR, z.s.\nZelený pruh 1294/50, 147 08 Praha 4\nwww.czb.cz, czb@czb.cz"]
[]
[null,null,null,null,null,null,null," KALKULÁTOR PRO STANOVENÍ POČTU HMOŽDINEK"]
[null,null,null,null,null,null,null,"V ETICS POMOCÍ ZJEDNODUŠENÉHO NÁVRHU"]
[null,null,null,null,null,null,null,"dle článku 5.4.3 ČSN 73 2902 Vnější tepelně izolační kompozitní systémy (ETICS)"]
[null,null,null,null,null,null,null,"Firemní verze společnosti ROCKWOOL, a.s."]
[]
[]
[]
[]
[]
[]
[]
[]
[]
[null,null,null,null,null,null,null,"  Technické poradenství: 800 161 161, info@rockwool.cz "]
[]
[]
[null,null,{"$f":"\"© 2016\"&IF(YEAR(TODAY())>2016,\"-\"&YEAR(TODAY()),\"\")&\" Cech pro zateplování budov ČR, z.s. Autor ZDK.\"","v":"© 2016 Cech pro zateplování budov ČR, z.s. Autor ZDK."},null,null,null,null,null,null,null,null,null,null,null,null,null,null,null,null,null,true]
[null,null,"    Verze 1-CZB-2016-rockwool-1. Vydáním této verze pozbývají platnost veškeré předcházející verze tohoto kalkulátoru."]

{"sheet":"0b","index":1,"n_rows":28,"n_cols":21,"rows_kept":28,"cut":false,"hidden":false,"merged":[]}
[null,null,null,null,"KALKULÁTOR PRO STANOVENÍ POČTU HMOŽDINEK V ETICS"]
[]
[null,null,"Pomocí tohoto kalkulátoru lze stanovit počty hmoždinek pro kotvení desek FRONTROCK MAX E a FASROCK v systémech ETICS mechanicky"]
[null,null,"kotvených s doplňkovým lepením. Výpočet probíhá pomocí zjednodušeného návrhu dle článku 5.4.3 ČSN 73 2902, na základě zvolených"]
[null,null,"charakteristik objektu (výška, větrová oblast, kategorie terénu, podkladní materiál), zvoleného tepelněizolačního materiálu a hmoždinky."]
[]
[null,null,"Zjednodušený výpočet pomocí tohoto kalkulátoru lze provést výhradně pro hmoždinky, jejichž shoda byla prokázána podle Řídících pokynů"]
[null,null,"ETAG 014 a jsou součástí ETICS podle dokumentace výrobce ETICS, který prokázal shodu systému postupem podle Řídících pokynů ETAG 004."]
[null,null,"a tepelněizolačním deskám. Kalkulátor je určen pro výpočet kotvení tepelněizolačních desek o tloušťkách ≥ 100 mm."]
[null,null,"Za využití hodnot z tohoto kalkulátoru je plně odpovědná osoba, která ho používá."]
[]
[null,null,"Kalkulátor obsahuje databázi hmoždinek od jednotlivých výrobců, členů Cechu pro zateplování budov, jehož členem je i ROCKWOOL, a.s."]
[null,null,"Všechny hmoždinky použité v tomto kalkulátoru splňují kritéria kvalitativní třídy A CZB."]
[]
[null,null,"Výpočet probíhá formou průvodce - v prvním kroku se zadají charakteristiky objektu, ve druhém kroku se z nabídky všech hmoždinek"]
[null,null,"vhodných pro daný typ podkladu zvolí jedna hmoždinka a upřesní se podkladní materiál a ve třetím kroku se zobrazí vypočítané výsledky,"]
[null,null,"tj. vhodnost zvolené hmoždinky, počty hmoždinek pro okrajové a vnitřní oblasti fasády a také schéma doporučeného rozmístění hmoždinek."]
[]
[null,null,"Hodnoty protažení hmoždinek deskou z MW TR 10 jsou redukovány dle vzorce: R' = R - (1 - TRd/TRm) × 0,4 × R, používaného TZUS."]
[null,null,"Redukcí je zajištěno, aby nebyly hodnoty odolnosti protažení nadhodnoceny provedením zkoušky na tepelněizolačním výrobku výrazně"]
[null,null,"lepších vlastností oproti deklarované produkci. Kalkulátor využívá jako zdroj informací údaje z ČSN 73 2902:2011 a z ČSN EN 1991-1-4."]
[null,null,"Použité části ČSN 73 2902:2011 jsou vydány se souhlasem Úřadu pro technickou normalizaci, metrologii a státní zkušebnictví."]
[]
[null,null,"Kalkulátor je určen odborné veřejnosti a nelze jej bez souhlasu vydavatele měnit."]
[]
[null,null,{"$f":"'0a'!$C$21","v":"© 2016 Cech pro zateplování budov ČR, z.s. Autor ZDK."},null,null,null,null,null,null,null,null,null,null,null,null,null,null,null,null,null,true]
[null,null,{"$f":"'0a'!$C$22","v":"    Verze 1-CZB-2016-rockwool-1. Vydáním této verze pozbývají platnost veškeré předcházející verze tohoto kalkulátoru."}]
[null,null,"    Technické poradenství ROCKWOOL: 800 161 161, e-mail: info@rockwool.cz"]

{"sheet":"1","index":2,"n_rows":31,"n_cols":21,"rows_kept":31,"cut":false,"hidden":false,"merged":[[30,2,30,19],[2,12,3,19],[2,6,3,9],[11,2,12,10],[2,2,3,4],[2,10,3,10],[4,10,5,10],[20,2,21,10],[13,2,14,10],[15,2,17,10],[18,2,19,10],[12,12,13,19],[18,12,19,19],[27,2,27,19],[28,2,28,19],[29,2,29,19]]}
[null,null,null,null,null,null,"1. OBJEKT"]
[]
[null,null,"VÝŠKA OBJEKTU",null,null,null,"VĚTROVÁ OBLAST",null,null,null,"výběr",null,"PODKLADNÍ MATERIÁL dle ETAG 014"]
[]
[]
[]
[]
[]
[]
[]
[null,null,null,{"$f":"CHOOSE(výška_,\"do 10\",\"do 15\",\"do 25\",\"do 38\")","v":{"$error":"#VALUE!"}},null,null,null,{"$f":"CHOOSE(větrováoblast_,\"I\",\"II\",\"III\",\"IV\")","v":{"$error":"#VALUE!"}}]
[null,null,"KATEGORIE TERÉNU",null,null,null,null,null,null,null,null,null,null,{"$f":"CHOOSE(podklad_,\"A\",\"B\",\"C\",\"D\",\"E\",\"–\")","v":{"$error":"#VALUE!"}}]
[null,null,null,null,null,null,null,null,null,null,null,null,"TEPELNĚIZOLAČNÍ MATERIÁL"]
[]
[]
[]
[]
[]
[null,null,null,null,null,null,null,null,null,null,null,null,"ROZMĚR DESKY"]
[]
[]
[]
[]
[null,null,null,{"$f":"CHOOSE(terén_,\"I\",\"II\",\"III\",\"IV\")","v":{"$error":"#VALUE!"}},null,null,null,null,null,null,null,null,null,{"$f":"CHOOSE(izolant_,\"minerální vlna FRONTROCK MAX E\",\"minerální vlna FASROCK\")","v":{"$error":"#VALUE!"}},1,{"$f":"deska__+1","v":2},{"$f":"CHOOSE(deska_,\"500×1000\",\"600×1000\")","v":"600×1000"},false]
[null,null,null,null,null,null,null,null,null,null,null,null,null,null,null,null,null,null,null,null,{"$f":"AND(výška_>0,větrováoblast_>0,terén_>0,podklad_>0,izolant_>0,deska_>0,IF(myRpanel_=TRUE,myRpanel>0,TRUE))","v":false}]
[]
[null,null,"Poznámky:"]
[null,null,"Návrh mechanického upevnění ETICS na účinky sání větru hmoždinkami o známých vlastnostech lze provést zjednodušeným postupem v obvyklých případech, za  který se považují budovy nacházející se ve větrové oblasti I až IV podle ČSN EN 1991-1-4, u nichž proudění větru není nepříznivě ovlivněno jejich tvarem, polohou nebo překážkami v okolí a jejichž výška nad okolním terénem po horní hranu atiky nebo římsy nepřesáhne 38 m. Za obvyklý případ se nepovažují budovy umístěné na izolovaných kopcích, při horní hraně dlouhých svahů, budovy nejméně dvakrát vyšší než průměrná výška okolní zástavby, budovy neobvyklého tvaru apod."]
[null,null,"Podkladní materiál se v ČSN 73 2902 označuje jako nosná vrstva podkladu, která je definovaná jako vrstva, do níž bude hmoždinka nebo jiný mechanický upevňovací prostředek přenášet zatížení."]
[null,null,"Tento kalkulátor uvažuje s obvyklou skladbou ETICS. Za obvyklý případ se považují ETICS s charakteristickou plošnou hmotností vnějšího souvrství nejvýše 20 kg/m², jejichž tepelná izolace má takové mechanické vlastnosti, že vlastní hmotnost ETICS bezpečně přenese svou smykovou odolností a je s podkladem dostatečně spojena vrstvou lepicí hmoty."]
[null,null,"Tepelněizolační materiál musí mít pevnost v tahu kolmo k rovině desky nejméně TR 100 (pěnový polystyrén) a TR 10 (minerální vlna s podélným vláknem) podle ČSN EN 13162."]

{"sheet":"2","index":3,"n_rows":45,"n_cols":16,"rows_kept":45,"cut":false,"hidden":false,"merged":[[2,2,2,4],[14,2,15,4],[17,10,17,17],[18,10,18,17],[21,2,22,4],[2,10,2,15],[9,10,9,17],[10,10,10,17],[11,10,11,17],[12,10,12,17],[27,2,29,4],[13,10,13,17],[14,10,14,17],[15,10,15,17],[16,10,16,17]]}
[null,null,null,null,null,null,"2. HMOŽDINKY"]
[]
[null,null,"VÝROBCE",null,null,null,"hmoždinka","výrobce","typ",null,"HODNOTA ÚNOSTNOSTI NRk"]
[]
[]
[]
[null,null,null,null,null,null,null,null,null,null,null,"NRk =-",null," kN"]
[]
[null,null,null,null,null,null,null,null,null,null,"specifikace podkladu"]
[]
[]
[]
[]
[null,null,8,{"$f":"CHOOSE(výrobce_,\"Bravoll\",\"Ejot\",\"Fischer\",\"Hilti\",\"Kew\",\"Koelner\",\"Wkret-met\",\"libovolný\")","v":"libovolný"}]
[null,null,"TYP"]
[]
[]
[]
[]
[]
[null,null,3,{"$f":"CHOOSE(typ_,\"šroubovací\",\"zatloukací\",\"libovolný\")","v":"libovolný"}]
[null,null,"MONTÁŽ"]
[]
[]
[]
[]
[null,null,1,{"$f":"CHOOSE(montáž_,\"povrchová\",\"zápustná\")","v":"povrchová"}]
[null,null,"ROZŠIŘOVACÍ TALÍŘ"]
[]
[]
[]
[]
[]
[null,null,2,{"$f":"CHOOSE(talířek_,\"A\",\"N\")","v":"N"}]
[]
[]
[null,null,null,null,null,null,null,null,null,{"$f":"AND(výrobce_>0,typ_>0,talířek_>0,myHmoždinka<>\"\",IF(myNrk_=2,myNrk>0,myPodklad<>\"\"))","v":false},null,null,null,null,1,{"$f":"CHOOSE(kotvení_,0.68,0.8)","v":0.68}]
[null,null,{"$f":"IF(izolant_=\"\",1,izolant_)&montáž_","v":"11"}]
[null,null,"Poznámky:"]
[null,null,"Hmoždinky, posouzené podle postupů ETAG 014, lze navrhnout a použít pouze pro přenesení účinků zatížení, působícího rovnoběžně s osou hmoždinky."]
[null,null,"V mechanicky upevňovaných ETICS se smějí použít pouze hmoždinky s charakteristickou únosností v tahu NRk stanovenou podle postupů ETAG 014. Hodnotu NRk"]
[null,null,"uvádí výrobce v dokumentaci ETICS. Pokud ve schválené dokumentaci hmoždinky není uvedena její charakteristická únosnost NRk pro druh materiálu nosné vrstvy"]
[null,null,"podkladu zjištěný na stavbě, stanoví se tato zkouškami v laboratoři a/nebo in situ podle přílohy A s vyhodnocením podle čl. 5.4.1.3."]
[null,null,"Zjednodušený výpočet pomocí tohoto kalkulátoru lze provést výhradně pro hmoždinky, jejichž shoda byla prokázána podle Řídících pokynů"]
[null,null,"ETAG 014 a jsou součástí ETICS podle dokumentace výrobce ETICS, který prokázal shodu systému postupem podle Řídících pokynů ETAG 004."]

{"sheet":"3","index":4,"n_rows":85,"n_cols":18,"rows_kept":85,"cut":false,"hidden":false,"merged":[[84,2,84,19],[82,2,82,19],[83,2,83,19],[81,2,81,19],[2,2,3,8],[2,9,3,19],[38,2,39,19],[44,2,45,8],[77,2,77,19],[44,17,45,19],[44,9,45,16],[78,2,78,19]]}
["x",null,null,null,null,null,"3. VÝSLEDKY"]
[]
[null,null,"OBJEKT",null,null,null,null,null,null,"HMOŽDINKY"]
[]
[]
[null,null,{"$f":"\"výška objektu = \"&výška&\" m\"","v":{"$error":"#VALUE!"}},null,null,null,null,null,null,{"$f":"\"hmoždinka = \"&VLOOKUP(myHmoždinka,hmoDB,2,)&\" \"&myHmoždinka","v":{"$error":"#N/A"}}]
[null,null,{"$f":"\"větrová oblast = \"&větrováoblast","v":{"$error":"#VALUE!"}},null,null,null,null,null,null,{"$f":"\"ETA číslo = \"&VLOOKUP(myHmoždinka,hmoDB,6,)","v":{"$error":"#N/A"}}]
[null,null,{"$f":"\"kategorie terénu = \"&terén","v":{"$error":"#VALUE!"}},null,null,null,null,null,null,{"$f":"IF(podklad=\"–\",VLOOKUP(myHmoždinka,hmoDB,11,),\"bodový činitel prostupu tepla = \"&IFERROR(INDEX(db!$R$5:$R$321,MATCH(myHmoždinka&montáž,db!$B$5:$B$321&db!$P$5:$P$321,),1)*1&\" W/K\",VLOOKUP(myHmoždinka,hmoDB,17,)))","v":{"$error":"#VALUE!"}}]
[null,null,{"$f":"\"kategorie podkladu = \"&podklad","v":{"$error":"#VALUE!"}},null,null,null,null,null,null,{"$f":"\"typ = \"&VLOOKUP(myHmoždinka,hmoDB,3,)","v":{"$error":"#N/A"}}]
[null,null,{"$f":"\"izolant = \"&izolant","v":{"$error":"#VALUE!"}},null,null,null,null,null,null,{"$f":"\"montáž hmoždinky = \"&montáž","v":"montáž hmoždinky = povrchová"}]
[{"$f":"IF(AND(VLOOKUP(myHmoždinka,hmoDB,2,)=\"Bravoll\",montáž=\"zápustná\",talířek=\"N\"),\"zápustný přípravek ZP\",\"rozšiřovací talíř hmoždinky nepoužit\")","v":{"$error":"#N/A"}},null,{"$f":"\"šířka desky = \"&LEFT(deska,3)&\" mm\"","v":"šířka desky = 600 mm"},null,null,null,null,null,null,{"$f":"IF(talířek=\"N\",netalíř,\"rozšiřovací talíř hmoždinky = \"&VLOOKUP(VLOOKUP(myHmoždinka,hmoDB,2,)&\";\"&montáž,talířky,2,))","v":{"$error":"#N/A"}}]
[null,null,{"$f":"IF(myRpanel=0,\"\",\"hodnota Rpanel ze zkoušky protažením = \"&myRpanel&\" kN\")","v":""},null,null,null,null,null,null,{"$f":"IF(myNrk_=2,\"hodnota NRk z výtažných zkoušek = \"&myNrk&\" kN\",\"specifikace podkladu = \"&myPodklad)","v":"specifikace podkladu = "}]
[null,null,"VÝPOČTY:"]
[]
[null,null,"Objekt:",null,null,"třída únosnosti",null,null,null,null,"0,10","0,12","0,15","0,20","0,25","0,30","0,40","0,50"]
[null,null,{"$f":"větrováoblast&\";\"&terén&\";\"&výška","v":{"$error":"#VALUE!"}},null,null,{"$f":"\"hmoždinek\"&IF(deska_=2,\"/1,2\",\" na\")&\" m² (okrajové oblasti)\"","v":"hmoždinek/1,2 m² (okrajové oblasti)"},null,null,null,null,{"$f":"VLOOKUP(objekt&\"/\"&K$15,počtyhmoždinek,IF(deska_=2,8,7),)","v":{"$error":"#VALUE!"}},{"$error":"#VALUE!"},{"$error":"#VALUE!"},{"$error":"#VALUE!"},{"$error":"#VALUE!"},{"$error":"#VALUE!"},{"$error":"#VALUE!"},{"$error":"#VALUE!"}]
[null,null,null,null,null,{"$f":"\"hmoždinek\"&IF(deska_=2,\"/1,2\",\" na\")&\" m² (vnitřní oblasti)\"","v":"hmoždinek/1,2 m² (vnitřní oblasti)"},null,null,null,null,{"$f":"IF(K16=\"–\",\"–\",CEILING(MAX(75%*K16,6),2))","v":{"$error":"#VALUE!"}},{"$error":"#VALUE!"},{"$error":"#VALUE!"},{"$error":"#VALUE!"},{"$error":"#VALUE!"},{"$error":"#VALUE!"},{"$error":"#VALUE!"},{"$error":"#VALUE!"}]
[null,null,null,null,null,{"$f":"\"hmoždinek\"&IF(deska_=2,\"/1,2\",\" na\")&\" m² (okraj pro 15 m)\"","v":"hmoždinek/1,2 m² (okraj pro 15 m)"},null,null,null,null,{"$f":"VLOOKUP(větrováoblast&\";\"&terén&\";\"&\"do 15/\"&K$15,počtyhmoždinek,IF(deska_=2,8,7),)","v":{"$error":"#VALUE!"}},{"$error":"#VALUE!"},{"$error":"#VALUE!"},{"$error":"#VALUE!"},{"$error":"#VALUE!"},{"$error":"#VALUE!"},{"$error":"#VALUE!"},{"$error":"#VALUE!"}]
[null,null,null,null,null,{"$f":"\"hmoždinek\"&IF(deska_=2,\"/1,2\",\" na\")&\" m² (vnitřní pro 15 m)\"","v":"hmoždinek/1,2 m² (vnitřní pro 15 m)"},null,null,null,null,{"$f":"IF(K18=\"–\",\"–\",CEILING(MAX(75%*K18,6),2))","v":{"$error":"#VALUE!"}},{"$error":"#VALUE!"},{"$error":"#VALUE!"},{"$error":"#VALUE!"},{"$error":"#VALUE!"},{"$error":"#VALUE!"},{"$error":"#VALUE!"},{"$error":"#VALUE!"}]
[]
[null,null,"Izolant:",null,null,"gMb pro izolant",null,null,{"$f":"VLOOKUP(izolant_,izolanty,3,)","v":{"$error":"#N/A"}}]
[null,null,{"$f":"VLOOKUP(izolant_,izolanty,2,)","v":{"$error":"#N/A"}},null,null,"Rpanel,sm",null,null,{"$f":"IF(myRpanel_=TRUE,myRpanel,VLOOKUP(izolant&montáž&myHmoždinka&talířek,Rpanely,COLUMN(param!$L$10)-COLUMN(param!$G$10)+1,))","v":{"$error":"#VALUE!"}},"kN"]
[null,null,null,null,null,"Rjoint,sm",null,null,{"$f":"VLOOKUP(izolant_,izolanty,5,)","v":{"$error":"#N/A"}},"kN"]
[null,null,null,null,null,"Rd,hm",null,null,{"$f":"kotvení*I22/I21","v":{"$error":"#VALUE!"}},"kN"]
[null,null,null,null,null,"třída únosnosti hm.",null,null,{"$f":"INDEX(třídy,1,MATCH(I24,Rmin))","v":{"$error":"#VALUE!"}}]
[]
[null,null,"Podklad:",null,null,"kategorie dle ETAG 014",null,null,null,{"$f":"VLOOKUP(podklad_,podklady,3,)","v":{"$error":"#N/A"}},{"$f":"IF(J27=\"–\",\"\",VLOOKUP(podklad_,podklady,2,))","v":{"$error":"#N/A"}}]
[null,null,null,null,null,"gMc pro šroubovací hmoždinky",null,null,null,{"$f":"IF(podklad<>\"–\",VLOOKUP(podklad_,podklady,4,),IF(myNrk_=1,VLOOKUP(myHmoždinka&\"_\"&myPodklad,hmoDBi,14,),VLOOKUP(myHmoždinka,podkladynezname,3,)))","v":{"$error":"#VALUE!"}}]
[null,null,null,null,null,"gMc pro zatloukací hmoždinky",null,null,null,{"$f":"IF(podklad<>\"–\",VLOOKUP(podklad_,podklady,5,),IF(myNrk_=1,VLOOKUP(myHmoždinka&\"_\"&myPodklad,hmoDBi,14,),VLOOKUP(myHmoždinka,podkladynezname,3,)))","v":{"$error":"#VALUE!"}}]
[]
[null,null,"Hmoždinka:",null,null,"typ",null,null,{"$f":"VLOOKUP(myHmoždinka,hmoDB,3,)","v":{"$error":"#N/A"}}]
[null,null,null,null,null,"NRk",null,null,{"$f":"IF(myNrk_=2,myNrk,VLOOKUP(myHmoždinka&\"_\"&myPodklad,hmoDBi,13,))","v":{"$error":"#N/A"}},"kN"]
[null,null,null,null,null,"Rd,hm",null,null,{"$f":"I32/IF(I31=\"šroubovací\",J28,J29)","v":{"$error":"#N/A"}},"kN"]
[null,null,null,null,null,"třída únosnosti hm.",null,null,{"$f":"IF(I33<0.1,\"0,00\",INDEX(třídy,1,MATCH(I33,Rmin)))","v":{"$error":"#N/A"}}]
[null,null,null,null,null,"třída únosnosti",null,null,{"$f":"IF(I34<I25,I34,I25)","v":{"$error":"#N/A"}}]
[]
[]
[]
[null,null,"VÝSLEDEK VÝPOČTŮ"]
[]
[]
[null,null,{"$f":"\"Zvolená hmoždinka \"&IF(check=FALSE,\"VYHOVUJE\",\"NEVYHOVUJE\")&\" pro kotvení zvoleného tepelněizolačního materiálu na zvoleném objektu\"&IF(check=FALSE,\".\",\",\")","v":{"$error":"#DIV/0!"}}]
[null,null,{"$f":"IF(check=TRUE,\"z důvodu příliš vysokého počtu hmoždinek na 1 m² (maximum je \"&IF(ecotwist,12,16)&\" ks/m²).\",\"\")","v":{"$error":"#DIV/0!"}}]
[]
[null,null,"POČTY A ROZMÍSTĚNÍ HMOŽDINEK",null,null,null,null,null,null,{"$f":"IF(deska_=2,\"Počty hmoždinek jsou uvedeny v ks/1,2 m², tj. na 2 desky\",\"Počty hmoždinek jsou uvedeny v ks/m², tj. na 2 desky\")","v":"Počty hmoždinek jsou uvedeny v ks/1,2 m², tj. na 2 desky"},null,null,null,null,null,null,null,{"$f":"IF(deska_=2,\"600x1000 mm.\",\"500x1000 mm.\")","v":"600x1000 mm."}]
[]
[]
[null,null,null,"Doporučené počty hmoždinek pro okrajové a vnitřní oblasti fasády jsou:"]
[]
[null,null,null,"okrajová oblast",null,"vnitřní oblast",null,null,null,"okrajová oblast"]
[null,null,{"$f":"IF(hmoTřída=\"0,00\",\"–\",IF(výška_<3,\"\",HLOOKUP(I35,$K$15:$R$19,2,)))","v":{"$error":"#N/A"}},"A2",null,{"$f":"IF(hmoTřída=\"0,00\",\"–\",IF(výška_<3,\"\",HLOOKUP(I35,$K$15:$R$19,3,)))","v":{"$error":"#N/A"}},"B2",null,null,"A2",null," pro výšku nad 15 m"]
[null,null,null,{"$f":"IFERROR(C51*1&IF(deska_=2,\" ks/1,2 m²\",\" ks/m²\"),\"–\")","v":"–"},null,null,{"$f":"IFERROR(F51*1&IF(deska_=2,\" ks/1,2 m²\",\" ks/m²\"),\"–\")","v":"–"},null,null,{"$f":"D52","v":"–"}]
[null,null,null,{"$f":"IFERROR(IF(deska_=2,\"(\"&ROUND(C51/1.2,2)&\" ks/m²)\",\"\"),\"\")","v":""},null,null,{"$f":"IFERROR(IF(deska_=2,\"(\"&ROUND(F51/1.2,2)&\" ks/m²)\",\"\"),\"\")","v":""},null,null,{"$f":"D53","v":""}]
[null,null,{"$f":"IF(hmoTřída=\"0,00\",\"–\",HLOOKUP(I35,$K$15:$R$19,IF(výška_<3,2,4),))","v":{"$error":"#N/A"}},"A1",null,{"$f":"IF(hmoTřída=\"0,00\",\"–\",HLOOKUP(I35,$K$15:$R$19,IF(výška_<3,3,5),))","v":{"$error":"#N/A"}},"B1",null,null,"A1"]
[null,null,null,{"$f":"IFERROR(C54*1&IF(deska_=2,\" ks/1,2 m²\",\" ks/m²\"),\"–\")","v":"–"},null,null,{"$f":"IFERROR(F54*1&IF(deska_=2,\" ks/1,2 m²\",\" ks/m²\"),\"–\")","v":"–"},null,null,{"$f":"D55","v":"–"},null,{"$f":"IF(výška_>2,\" do výšky 15 m\",\"\")","v":""}]
[null,null,null,{"$f":"IFERROR(IF(deska_=2,\"(\"&ROUND(C54/1.2,2)&\" ks/m²)\",\"\"),\"\")","v":""},null,null,{"$f":"IFERROR(IF(deska_=2,\"(\"&ROUND(F54/1.2,2)&\" ks/m²)\",\"\"),\"\")","v":""},null,null,{"$f":"D56","v":""},null,{"$f":"IF(myHmoždinka=\"\",1/0,OR(D55=\"–\",G55=\"–\",IF(výška_>2,OR(D52=\"–\",G52=\"–\"),FALSE)))","v":{"$error":"#DIV/0!"}}]
[]
[null,null,null,"Rozmístění hmoždinek pro okrajové oblasti fasády:",null,null,null,null,null,null,null,null,"Rozmístění hmoždinek pro vnitřní oblasti fasády:"]
[]
[null,null,null,"A2",null,null,null,null,null,null,null,null,"B2"]
[null,null,null,{"$f":"IFERROR(C51*1,\"\")","v":""},null,null,null,null,null,null,null,null,{"$f":"IFERROR(F51*1,\"\")","v":""}]
[null,null,null,{"$f":"SUBSTITUTE(D53,\" ks/m²\",\"\")","v":""},null,null,null,null,null,null,null,null,{"$f":"SUBSTITUTE(G53,\" ks/m²\",\"\")","v":""}]
[]
[]
[]
[]
[null,null,null,"A1",null,null,null,null,null,null,null,null,"B1"]
[null,null,null,{"$f":"IFERROR(C54*1,\"\")","v":""},null,null,null,null,null,null,null,null,{"$f":"IFERROR(F54*1,\"\")","v":""}]
[null,null,null,{"$f":"SUBSTITUTE(D56,\" ks/m²\",\"\")","v":""},null,null,null,null,null,null,null,null,{"$f":"SUBSTITUTE(G56,\" ks/m²\",\"\")","v":""}]
[]
[]
[]
[]
[]
[]
[]
[null,null,"Upozornění:"]
[null,null,"Za využití hodnot z tohoto kalkulátoru je plně odpovědná osoba, která ho používá. Pokud nejsou výsledky opatřeny autorizačním razítkem projektanta, je nutno uvedené výsledky v protokolu považovat pouze za orientační."]
[null,null,{"$f":"\"Ve výpočtu použitý typ hmoždinky \"&IF(myHmoždinka=\"\",\"\",\"(\"&myHmoždinka&\") \")&\"a způsob montáže \"&IF(myHmoždinka=\"\",\"\",\"(\"&montáž&\") \")&\"musí být v souladu se specifikacemi v dokumentaci příslušného ETICS a s dokumentací k provádění příslušného ETICS.\"","v":"Ve výpočtu použitý typ hmoždinky a způsob montáže musí být v souladu se specifikacemi v dokumentaci příslušného ETICS a s dokumentací k provádění příslušného ETICS."}]
[null,null,{"$f":"\"Dosažené výsledky byly zpracovány kalkulátorem verze \"&MID('0a'!$C$22,11,SEARCH(\". Vydáním\",'0a'!$C$22)-11)&\".\"","v":"Dosažené výsledky byly zpracovány kalkulátorem verze 1-CZB-2016-rockwool-1."}]
[null,null,"Poznámky:"]
[null,null,"Navržený počet hmoždinek u desek o rozměru 500x1000 mm nemá být nižší než 6 ks/m² a nemá být vyšší než 16 ks/m². U desek jiných rozměrů stanoví nejnižší a nejvyšší doporučený počet hmoždinek výrobce v dokumentaci ETICS. U přířezů desek se počet desek a poloha hmoždinek upraví s ohledem na jejich rozměry případně i polohu. Navržený počet hmoždinek na m² se přizpůsobí rozměrům desek použité tepelné izolace směrem nahoru tak, aby na každou celou desku připadl počet hmoždinek vyjádřený celým číslem. Doporučuje se, aby navržený počet hmoždinek na m² nepřesáhl 12 kusů."]
[null,null,"U budov vyšších než 15 metrů lze plochy pláště členit na dvě výšková pásma. První pásmo se stanovuje do výšky 15 metrů včetně, druhé pásmo se stanovuje od výšky 15 metrů až do celkové výšky budovy. Účinky zatížení větrem v prvním pásmu se uvažují hodnotou příslušející výšce budovy 15 metrů, účinky zatížení větrem ve druhém pásmu se uvažují hodnotou příslušející největší výšce budovy."]
[null,null,"Počet hmoždinek na m² ve vnitřní oblasti (B) se může proti okrajové oblasti (A) snížit nejvýše o 25%, vždy ale musí na celou desku tepelné izolace připadat počet hmoždinek vyjádřený celým číslem. Při počtu hmoždinek 3 ks na desku (6 ks/m² u desek 500×1000 mm a 5 ks/m² u desek 600×1000 mm) se počet hmoždinek ve vnitřní oblasti plochy nemá snižovat."]
[null,{"$f":"IF(izolant_=5,\" \",\"\")","v":""},"V případě použití desek z polystyrénu s TR<100 kPa musí být vypočtená hodnota počtu hmoždinek považována pouze za orientační, neboť norma ČSN 73 29 02 neumožňuje u těchto desek návrh počtu hmoždinek dle zjednodušeného výpočtu. Návrh kotvení musí provést projektant - statik."]

{"sheet":"4","index":5,"n_rows":92,"n_cols":21,"rows_kept":92,"cut":false,"hidden":false,"merged":[[10,2,11,8],[10,9,11,19],[46,2,47,19],[52,2,53,8],[52,9,53,16],[52,17,53,19],[86,2,86,19],[5,14,7,19],[5,2,5,3],[5,4,5,13],[8,2,8,3],[8,9,8,10],[8,11,8,13],[6,2,6,3],[6,4,6,13],[7,2,7,3],[7,4,7,13],[8,4,8,8],[85,2,85,19]]}
[null,null,null,null,null,null,null,"KALKULÁTOR PRO STANOVENÍ POČTU HMOŽDINEK"]
[null,null,null,null,null,null,null," V ETICS POMOCÍ ZJEDNODUŠENÉHO NÁVRHU"]
[null,null,null,null,null,null,null," dle článku 5.4.3 ČSN 73 2902 Vnější tepelně izolační kompozitní systémy (ETICS)"]
[null,null,null,null,null,null,null," Firemní verze společnosti ROCKWOOL, a.s."]
[]
[null,null,"Stavba:",null,"DOPLŇTE NÁZEV"]
[null,null,"Adresa:",null,"DOPLŇTE ADRESU"]
[null,null,"Investor:",null,"DOPLŇTE INVESTORA"]
[null,null,"Zpracoval:",null,"DOPLŇTE ZPRACOVATELE",null,null,null,null,"Datum:",null,"DOPLŇTE DATUM",null,null,"Razítko a podpis autorizované osoby ČKAIT"]
[]
[null,null,"OBJEKT",null,null,null,null,null,null,"HMOŽDINKY"]
[]
[]
[]
[]
[]
[]
[]
[]
[]
[]
[]
[]
[]
[]
[]
[]
[]
[]
[]
[]
[]
[]
[]
[]
[]
[]
[]
[]
[]
[]
[]
[]
[]
[]
[]
[null,null,"VÝSLEDEK VÝPOČTŮ"]
[]
[]
[null,null,{"$error":"#DIV/0!"}]
[null,null,{"$error":"#DIV/0!"}]
[]
[null,null,"POČTY A ROZMÍSTĚNÍ HMOŽDINEK",null,null,null,null,null,null,"Počty hmoždinek jsou uvedeny v ks/1,2 m², tj. na 2 desky",null,null,null,null,null,null,null,"600x1000 mm."]
[]
[]
[null,null,null,"Doporučené počty hmoždinek pro okrajové a vnitřní oblasti fasády jsou:"]
[]
[null,null,null,"okrajová oblast",null,"vnitřní oblast",null,null,null,"okrajová oblast"]
[null,null,{"$f":"IF(hmoTřída=\"0,00\",\"–\",IF(výška_<3,\"\",HLOOKUP(I43,$K$15:$R$19,2,)))","v":{"$error":"#N/A"}},"A2",null,{"$f":"IF(hmoTřída=\"0,00\",\"–\",IF(výška_<3,\"\",HLOOKUP(I43,$K$15:$R$19,3,)))","v":{"$error":"#N/A"}},"B2",null,null,"A2",null," pro výšku nad 15 m   2"]
[null,null,null,"–",null,null,"–",null,null,"–"]
[null,null,null,"",null,null,"",null,null,""]
[null,null,{"$f":"IF(hmoTřída=\"0,00\",\"–\",HLOOKUP(I43,$K$15:$R$19,IF(výška_<3,2,4),))","v":{"$error":"#N/A"}},"A1",null,{"$f":"IF(hmoTřída=\"0,00\",\"–\",HLOOKUP(I43,$K$15:$R$19,IF(výška_<3,3,5),))","v":{"$error":"#N/A"}},"B1",null,null,"A1"]
[null,null,null,"–",null,null,"–",null,null,"–",null,""]
[null,null,null,"",null,null,"",null,null,"",null,{"$error":"#DIV/0!"}]
[]
[null,null,null,"Rozmístění hmoždinek pro okrajové oblasti fasády:",null,null,null,null,null,null,null,null,"Rozmístění hmoždinek pro vnitřní oblasti fasády:"]
[]
[null,null,null,"A2",null,null,null,null,null,null,null,null,"B2"]
[null,null,null,"",null,null,null,null,null,null,null,null,""]
[null,null,null,"",null,null,null,null,null,null,null,null,""]
[]
[]
[]
[]
[null,null,null,"A1",null,null,null,null,null,null,null,null,"B1"]
[null,null,null,"",null,null,null,null,null,null,null,null,""]
[null,null,null,"",null,null,null,null,null,null,null,null,""]
[]
[]
[]
[]
[]
[]
[]
[null,null,"Upozornění:"]
[null,null,"Za využití hodnot z tohoto kalkulátoru je plně odpovědná osoba, která vystavila tento protokol. Pokud nejsou výsledky opatřeny autorizačním razítkem projektanta, je nutno uvedené výsledky v protokolu považovat pouze za orientační."]
[null,null,{"$f":"\"Ve výpočtu použitý typ hmoždinky \"&IF(myHmoždinka=\"\",\"\",\"(\"&myHmoždinka&\") \")&\"a způsob montáže \"&IF(myHmoždinka=\"\",\"\",\"(\"&montáž&\") \")&\"musí být v souladu se specifikacemi v dokumentaci příslušného ETICS a s dokumentací k provádění příslušného ETICS.\"","v":"Ve výpočtu použitý typ hmoždinky a způsob montáže musí být v souladu se specifikacemi v dokumentaci příslušného ETICS a s dokumentací k provádění příslušného ETICS."}]
[null,null,{"$f":"\"Dosažené výsledky byly zpracovány kalkulátorem verze \"&MID('0a'!$C$22,11,SEARCH(\". Vydáním\",'0a'!$C$22)-11)&\".\"","v":"Dosažené výsledky byly zpracovány kalkulátorem verze 1-CZB-2016-rockwool-1."}]
[]
[]
[null,null,{"$f":"'0a'!$C$21","v":"© 2016 Cech pro zateplování budov ČR, z.s. Autor ZDK."},null,null,null,null,null,null,null,null,null,null,null,null,null,null,null,null,null,true]
[null,null,"    Technické poradenství ROCKWOOL: 800 161 161, e-mail: info@rockwool.cz"]

{"sheet":"větrnéoblasti","index":6,"n_rows":75,"n_cols":3,"rows_kept":75,"cut":false,"hidden":false,"merged":[]}
[null,"Místo","Větrová"]
[null,null,"oblast"]
[null,"Benešov","II"]
[null,"Beroun","II"]
[null,"Blansko","II"]
[null,"Břeclav","II"]
[null,"Brno","II"]
[null,"Bruntál","III"]
[null,"Česká Lípa","II"]
[null,"České Budějovice","II"]
[null,"Český Krumlov","II"]
[null,"Děčín","II"]
[null,"Domažlice","II"]
[null,"Frýdek-Místek","II"]
[null,"Havlíčkův Brod","II"]
[null,"Hlinsko","IV"]
[null,"Hodonín","II"]
[null,"Hradec Králové","II"]
[null,"Cheb","I"]
[null,"Chomutov","II"]
[null,"Chrudim","III"]
[null,"Jablonec n/N","III"]
[null,"Jičín","II"]
[null,"Jihlava","II"]
[null,"Jindřichův Hradec","II"]
[null,"Karlovy Vary","I"]
[null,"Karviná","II (I)"]
[null,"Kladno","II"]
[null,"Klatovy","II"]
[null,"Kolín","II"]
[null,"Kroměříž","I"]
[null,"Kutná Hora","II"]
[null,"Liberec","II"]
[null,"Litoměřice","II"]
[null,"Louny","II"]
[null,"Mělník","I"]
[null,"Mladá Boleslav","II"]
[null,"Most","II"]
[null,"Náchod","II"]
[null,"Nový Jičín","II"]
[null,"Nymburk","I"]
[null,"Olomouc","I"]
[null,"Opava","II"]
[null,"Ostrava","II"]
[null,"Pardubice","II"]
[null,"Pelhřimov","II"]
[null,"Písek","II"]
[null,"Plzeň","II"]
[null,"Praha","II (I)"]
[null,"Prachatice","II"]
[null,"Přerov","II"]
[null,"Příbram","II"]
[null,"Prostějov","II (I)"]
[null,"Rakovník","II"]
[null,"Rokycany","II"]
[null,"Rychnov n/K","II"]
[null,"Semily","III"]
[null,"Sokolov","II"]
[null,"Strakonice","II"]
[null,"Svitavy","III"]
[null,"Šumperk","II"]
[null,"Tábor","II"]
[null,"Tachov","II"]
[null,"Tanvald","V"]
[null,"Teplice","II"]
[null,"Třebíč","II"]
[null,"Trutnov","II"]
[null,"Uherské Hradiště","II"]
[null,"Ústí nad Labem","II"]
[null,"Ústí nad Orlicí","I"]
[null,"Vsetín","II"]
[null,"Vyškov","II"]
[null,"Zlín","I (II)"]
[null,"Znojmo","III"]
[null,"Žďár n/S","III"]

{"sheet":"db","index":7,"n_rows":321,"n_cols":18,"rows_kept":321,"cut":false,"hidden":true,"merged":[]}
[null,"hmoždinka","výrobce","typ","izolant","montáž","podklad","průtah",null,"hmoždinka","podklad","specifikace podkladu"]
[null,"*",{"$f":"IF(výrobce=\"libovolný\",\"*\",výrobce)","v":"*"},{"$f":"IF(typ=\"libovolný\",\"*\",typ)","v":"*"},{"$f":"VLOOKUP(izolant,param!$H$1:$N$9,7,)","v":{"$error":"#VALUE!"}},{"$f":"montáž","v":"povrchová"},{"$f":"podklad","v":{"$error":"#VALUE!"}},"ANO",null,{"$f":"IF(myHmoždinka=\"\",\"ejotherm NT U\",myHmoždinka)","v":"ejotherm NT U"},{"$f":"podklad","v":{"$error":"#VALUE!"}},"*"]
[]
["index","hmoždinka","výrobce","typ","Tuhost talířku c [kN/mm]","Průměr talířku [mm]","ETA číslo","podklad","specifikace podkladu","Min. obj. hmotnost ρ [kg/dm³]","Min.pevnost v tlaku β [N/mm²]","Poznámka","Char. únosnost NRk (kN)","Souč.bezp.mont. gMc","izolant","montáž","průtah","Souč.bod. prostupu tepla (W/K)"]
[{"$f":"B5&\"_\"&I5","v":"termoz 8 U_beton C12/15-C50/60"},"termoz 8 U","fischer","šroubovací",0.5,60,"02/0019","A","beton C12/15-C50/60",null,null,null,1.5,null,"MW","povrchová",{"$f":"IF(ISERROR(VLOOKUP(izolant&montáž&B5&talířek,Rpanely,6,)),\"NE\",\"ANO\")","v":"NE"},2E-3]
["termoz 8 U_plná vápenopísková cihla","termoz 8 U","fischer","šroubovací",0.5,60,"02/0019","B","plná vápenopísková cihla",1.6,12,null,1.5,null,"MW","povrchová","NE",2E-3]
["termoz 8 U_plná pálená cihla","termoz 8 U","fischer","šroubovací",0.5,60,"02/0019","B","plná pálená cihla",1.6,12,null,1.5,null,"MW","povrchová","NE",2E-3]
["termoz 8 U_vertikálně děrovaná vápenopísková cihla","termoz 8 U","fischer","šroubovací",0.5,60,"02/0019","C","vertikálně děrovaná vápenopísková cihla",1.4,12,null,0.75,null,"MW","povrchová","NE",2E-3]
["termoz 8 U_vertikálně děrovaná cihla s hliněným střepem","termoz 8 U","fischer","šroubovací",0.5,60,"02/0019","C","vertikálně děrovaná cihla s hliněným střepem",1.2,12,null,0.75,null,"MW","povrchová","NE",2E-3]
["termoz 8 U_dutinové tvárnice z lehčeného betonu","termoz 8 U","fischer","šroubovací",0.5,60,"02/0019","C","dutinové tvárnice z lehčeného betonu",0.5,2,null,0.4,null,"MW","povrchová","NE",2E-3]
["termoz 8 U_tvárnice z lehčeného betonu","termoz 8 U","fischer","šroubovací",0.5,60,"02/0019","C","tvárnice z lehčeného betonu",0.5,4,null,0.6,null,"MW","povrchová","NE",2E-3]
["termoz 8 U_pórobeton P2","termoz 8 U","fischer","šroubovací",0.5,60,"02/0019","E","pórobeton P2",0.35,2,null,0.5,null,"MW","povrchová","NE",2E-3]
["termoz 8 U_pórobeton P4","termoz 8 U","fischer","šroubovací",0.5,60,"02/0019","E","pórobeton P4",0.5,4,null,1.2,null,"MW","povrchová","NE",2E-3]
["termofix CF 8_beton C12/15","termofix CF 8","fischer","zatloukací",0.5,60,"07/0287","A","beton C12/15",null,null,null,0.6,null,"MW","povrchová","NE",2E-3]
["termofix CF 8_beton C16/20","termofix CF 8","fischer","zatloukací",0.5,60,"07/0287","A","beton C16/20",null,null,null,0.75,null,"MW","povrchová","NE",2E-3]
["termofix CF 8_beton C50/60","termofix CF 8","fischer","zatloukací",0.5,60,"07/0287","A","beton C50/60",null,null,null,0.9,null,"MW","povrchová","NE",2E-3]
["termofix CF 8_plná vápenopísková cihla","termofix CF 8","fischer","zatloukací",0.5,60,"07/0287","B","plná vápenopísková cihla",1.8,12,null,0.75,null,"MW","povrchová","NE",2E-3]
["termofix CF 8_plná pálená cihla","termofix CF 8","fischer","zatloukací",0.5,60,"07/0287","B","plná pálená cihla",2,12,null,0.9,null,"MW","povrchová","NE",2E-3]
["termofix CF 8_vertikálně děrovaná vápenopísková cihla","termofix CF 8","fischer","zatloukací",0.5,60,"07/0287","C","vertikálně děrovaná vápenopísková cihla",1.4,12,null,0.75,null,"MW","povrchová","NE",2E-3]
["termofix CF 8_vertikálně děrovaná cihla s hliněným střepem","termofix CF 8","fischer","zatloukací",0.5,60,"07/0287","C","vertikálně děrovaná cihla s hliněným střepem",1,12,null,0.6,null,"MW","povrchová","NE",2E-3]
["termofix CF 8_lehký beton s kamenivem","termofix CF 8","fischer","zatloukací",0.5,60,"07/0287","D","lehký beton s kamenivem",1.4,8,null,0.3,null,"MW","povrchová","NE",2E-3]
["termofix CF 8_lehké betonové děrované bloky","termofix CF 8","fischer","zatloukací",0.5,60,"07/0287","D","lehké betonové děrované bloky",1.2,10,null,0.5,null,"MW","povrchová","NE",2E-3]
["termofix CF 8_lehké betonové plné bloky","termofix CF 8","fischer","zatloukací",0.5,60,"07/0287","D","lehké betonové plné bloky",0.8,6,null,0.4,null,"MW","povrchová","NE",2E-3]
["termoz CN 8_beton C12/15-C50/60","termoz CN 8","fischer","zatloukací",0.6,60,"09/0394","A","beton C12/15-C50/60",null,null,null,0.9,null,"MW","povrchová","NE",0]
[{"$f":"B25&\"_\"&I25","v":"termoz CN 8_plná vápenopísková cihla"},"termoz CN 8","fischer","zatloukací",0.6,60,"09/0394","B","plná vápenopísková cihla",1.8,12,null,0.9,null,"MW","povrchová",{"$f":"IF(ISERROR(VLOOKUP(izolant&montáž&B25&talířek,Rpanely,6,)),\"NE\",\"ANO\")","v":"NE"},0]
["termoz CN 8_plná pálená cihla","termoz CN 8","fischer","zatloukací",0.6,60,"09/0394","B","plná pálená cihla",2,12,null,0.9,null,"MW","povrchová","NE",0]
["termoz CN 8_plná betonová tvárnice","termoz CN 8","fischer","zatloukací",0.6,60,"09/0394","B","plná betonová tvárnice",2,20,null,0.75,null,"MW","povrchová","NE",0]
["termoz CN 8_tvárnice z lehčeného betonu","termoz CN 8","fischer","zatloukací",0.6,60,"09/0394","B","tvárnice z lehčeného betonu",1.4,8,null,0.6,null,"MW","povrchová","NE",0]
["termoz CN 8_vertikálně děrovaná vápenopísková cihla s β ≥ 20 N/mm²","termoz CN 8","fischer","zatloukací",0.6,60,"09/0394","C","vertikálně děrovaná vápenopísková cihla s β ≥ 20 N/mm²",1.4,20,null,0.75,null,"MW","povrchová","NE",0]
["termoz CN 8_vertikálně děrovaná vápenopísková cihla s β ≥ 12 N/mm²","termoz CN 8","fischer","zatloukací",0.6,60,"09/0394","C","vertikálně děrovaná vápenopísková cihla s β ≥ 12 N/mm²",1.4,12,null,0.5,null,"MW","povrchová","NE",0]
["termoz CN 8_vertikálně děrovaná cihla s hliněným střepem","termoz CN 8","fischer","zatloukací",0.6,60,"09/0394","C","vertikálně děrovaná cihla s hliněným střepem",1,12,null,0.6,null,"MW","povrchová","NE",0]
["termoz CN 8_dutinové tvárnice z lehčeného betonu","termoz CN 8","fischer","zatloukací",0.6,60,"09/0394","C","dutinové tvárnice z lehčeného betonu",1.2,10,null,0.6,null,"MW","povrchová","NE",0]
["termoz CN 8_lehčený beton s pórovitým kamenivem s β ≥ 4 N/mm²","termoz CN 8","fischer","zatloukací",0.6,60,"09/0394","D","lehčený beton s pórovitým kamenivem s β ≥ 4 N/mm²",0.8,4,null,0.4,null,"MW","povrchová","NE",0]
["termoz CN 8_lehčený beton s pórovitým kamenivem s β ≥ 6 N/mm²","termoz CN 8","fischer","zatloukací",0.6,60,"09/0394","D","lehčený beton s pórovitým kamenivem s β ≥ 6 N/mm²",0.8,6,null,0.6,null,"MW","povrchová","NE",0]
["termoz CN 8_pórobeton P4","termoz CN 8","fischer","zatloukací",0.6,60,"09/0394","E","pórobeton P4",0.4,4,null,0.3,null,"MW","povrchová","NE",0]
["termoz CN 8_pórobeton P6","termoz CN 8","fischer","zatloukací",0.6,60,"09/0394","E","pórobeton P6",0.6,6,null,0.3,null,"MW","povrchová","NE",0]
[{"$f":"B37&\"_\"&I37","v":"termoz CS 8_beton C12/15"},"termoz CS 8","fischer","šroubovací",0.6,60,"14/0372","A","beton C12/15",null,null,null,1.2,null,"MW","povrchová",{"$f":"IF(ISERROR(VLOOKUP(izolant&montáž&B37&talířek,Rpanely,6,)),\"NE\",\"ANO\")","v":"NE"},"0,001 - 0,002 W/K (dle délky hmoždinky)"]
["termoz CS 8_beton C50/60","termoz CS 8","fischer","šroubovací",0.6,60,"14/0372","A","beton C50/60",null,null,null,1.5,null,"MW","povrchová","NE","0,001 - 0,002 W/K (dle délky hmoždinky)"]
["termoz CS 8_plná vápenopísková cihla s β ≥ 20 N/mm²","termoz CS 8","fischer","šroubovací",0.6,60,"14/0372","B","plná vápenopísková cihla s β ≥ 20 N/mm²",1.8,20,null,1.5,null,"MW","povrchová","NE","0,001 - 0,002 W/K (dle délky hmoždinky)"]
["termoz CS 8_plná vápenopísková cihla s β ≥ 12 N/mm²","termoz CS 8","fischer","šroubovací",0.6,60,"14/0372","B","plná vápenopísková cihla s β ≥ 12 N/mm²",1.8,12,null,0.9,null,"MW","povrchová","NE","0,001 - 0,002 W/K (dle délky hmoždinky)"]
["termoz CS 8_plná pálená cihla","termoz CS 8","fischer","šroubovací",0.6,60,"14/0372","B","plná pálená cihla",1.8,20,null,1.5,null,"MW","povrchová","NE","0,001 - 0,002 W/K (dle délky hmoždinky)"]
["termoz CS 8_plné betonové bloky s β ≥ 20 N/mm²","termoz CS 8","fischer","šroubovací",0.6,60,"14/0372","B","plné betonové bloky s β ≥ 20 N/mm²",2,20,null,1.2,null,"MW","povrchová","NE","0,001 - 0,002 W/K (dle délky hmoždinky)"]
["termoz CS 8_plné betonové bloky s β ≥ 12 N/mm²","termoz CS 8","fischer","šroubovací",0.6,60,"14/0372","B","plné betonové bloky s β ≥ 12 N/mm²",2,12,null,0.75,null,"MW","povrchová","NE","0,001 - 0,002 W/K (dle délky hmoždinky)"]
["termoz CS 8_plné bloky z lehčeného betonu","termoz CS 8","fischer","šroubovací",0.6,60,"14/0372","B","plné bloky z lehčeného betonu",1.4,8,null,0.5,null,"MW","povrchová","NE","0,001 - 0,002 W/K (dle délky hmoždinky)"]
["termoz CS 8_vápenopísková děrovaná cihla s β ≥ 20 N/mm²","termoz CS 8","fischer","šroubovací",0.6,60,"14/0372","C","vápenopísková děrovaná cihla s β ≥ 20 N/mm²",1.4,20,null,0.9,null,"MW","povrchová","NE","0,001 - 0,002 W/K (dle délky hmoždinky)"]
["termoz CS 8_vápenopísková děrovaná cihla s β ≥ 12 N/mm²","termoz CS 8","fischer","šroubovací",0.6,60,"14/0372","C","vápenopísková děrovaná cihla s β ≥ 12 N/mm²",1.4,12,null,0.5,null,"MW","povrchová","NE","0,001 - 0,002 W/K (dle délky hmoždinky)"]
["termoz CS 8_děrovaná pálená cihla s β ≥ 48 N/mm²","termoz CS 8","fischer","šroubovací",0.6,60,"14/0372","C","děrovaná pálená cihla s β ≥ 48 N/mm²",1.6,48,null,1.5,null,"MW","povrchová","NE","0,001 - 0,002 W/K (dle délky hmoždinky)"]
["termoz CS 8_děrovaná pálená cihla s β ≥ 12 N/mm²","termoz CS 8","fischer","šroubovací",0.6,60,"14/0372","C","děrovaná pálená cihla s β ≥ 12 N/mm²",1,12,null,0.6,null,"MW","povrchová","NE","0,001 - 0,002 W/K (dle délky hmoždinky)"]
["termoz CS 8_děrované bloky z lehčeného betonu s β ≥ 10 N/mm²","termoz CS 8","fischer","šroubovací",0.6,60,"14/0372","D","děrované bloky z lehčeného betonu s β ≥ 10 N/mm²",1.2,10,null,1.2,null,"MW","povrchová","NE","0,001 - 0,002 W/K (dle délky hmoždinky)"]
["termoz CS 8_děrované bloky z lehčeného betonu s β ≥ 8 N/mm²","termoz CS 8","fischer","šroubovací",0.6,60,"14/0372","D","děrované bloky z lehčeného betonu s β ≥ 8 N/mm²",1.2,8,null,0.9,null,"MW","povrchová","NE","0,001 - 0,002 W/K (dle délky hmoždinky)"]
["termoz CS 8_děrované bloky z lehčeného betonu s β ≥ 6 N/mm²","termoz CS 8","fischer","šroubovací",0.6,60,"14/0372","D","děrované bloky z lehčeného betonu s β ≥ 6 N/mm²",1.2,6,null,0.75,null,"MW","povrchová","NE","0,001 - 0,002 W/K (dle délky hmoždinky)"]
["termoz CS 8_děrované bloky z lehčeného betonu s β ≥ 4 N/mm²","termoz CS 8","fischer","šroubovací",0.6,60,"14/0372","D","děrované bloky z lehčeného betonu s β ≥ 4 N/mm²",1.2,4,null,0.5,null,"MW","povrchová","NE","0,001 - 0,002 W/K (dle délky hmoždinky)"]
["termoz CS 8_děrované bloky z lehčeného betonu s β ≥ 4 N/mm²","termoz CS 8","fischer","šroubovací",0.6,60,"14/0372","D","děrované bloky z lehčeného betonu s β ≥ 4 N/mm²",0.9,4,null,0.5,null,"MW","povrchová","NE","0,001 - 0,002 W/K (dle délky hmoždinky)"]
["termoz CS 8_lehčený beton s kamenivem","termoz CS 8","fischer","šroubovací",0.6,60,"14/0372","D","lehčený beton s kamenivem",0.9,6,null,0.75,null,"MW","povrchová","NE","0,001 - 0,002 W/K (dle délky hmoždinky)"]
["termoz CS 8_pórobeton P4","termoz CS 8","fischer","šroubovací",0.6,60,"14/0372","E","pórobeton P4",0.5,4,null,0.6,null,"MW","povrchová","NE","0,001 - 0,002 W/K (dle délky hmoždinky)"]
[{"$f":"B56&\"_\"&I56","v":"termoz CS 8_beton C12/15"},"termoz CS 8","fischer","šroubovací",0.6,60,"14/0372","A","beton C12/15",null,null,null,1.2,null,"MW","zápustná","NE","0,001 - 0,002 W/K (dle délky hmoždinky)"]
["termoz CS 8_beton C50/60","termoz CS 8","fischer","šroubovací",0.6,60,"14/0372","A","beton C50/60",null,null,null,1.5,null,"MW","zápustná","NE","0,001 - 0,002 W/K (dle délky hmoždinky)"]
["termoz CS 8_plná vápenopísková cihla s β ≥ 20 N/mm²","termoz CS 8","fischer","šroubovací",0.6,60,"14/0372","B","plná vápenopísková cihla s β ≥ 20 N/mm²",1.8,20,null,1.5,null,"MW","zápustná","NE","0,001 - 0,002 W/K (dle délky hmoždinky)"]
["termoz CS 8_plná vápenopísková cihla s β ≥ 12 N/mm²","termoz CS 8","fischer","šroubovací",0.6,60,"14/0372","B","plná vápenopísková cihla s β ≥ 12 N/mm²",1.8,12,null,0.9,null,"MW","zápustná","NE","0,001 - 0,002 W/K (dle délky hmoždinky)"]
["termoz CS 8_plná pálená cihla","termoz CS 8","fischer","šroubovací",0.6,60,"14/0372","B","plná pálená cihla",1.8,20,null,1.5,null,"MW","zápustná","NE","0,001 - 0,002 W/K (dle délky hmoždinky)"]
["termoz CS 8_plné betonové bloky s β ≥ 20 N/mm²","termoz CS 8","fischer","šroubovací",0.6,60,"14/0372","B","plné betonové bloky s β ≥ 20 N/mm²",2,20,null,1.2,null,"MW","zápustná","NE","0,001 - 0,002 W/K (dle délky hmoždinky)"]
["termoz CS 8_plné betonové bloky s β ≥ 12 N/mm²","termoz CS 8","fischer","šroubovací",0.6,60,"14/0372","B","plné betonové bloky s β ≥ 12 N/mm²",2,12,null,0.75,null,"MW","zápustná","NE","0,001 - 0,002 W/K (dle délky hmoždinky)"]
["termoz CS 8_plné bloky z lehčeného betonu","termoz CS 8","fischer","šroubovací",0.6,60,"14/0372","B","plné bloky z lehčeného betonu",1.4,8,null,0.5,null,"MW","zápustná","NE","0,001 - 0,002 W/K (dle délky hmoždinky)"]
["termoz CS 8_vápenopísková děrovaná cihla s β ≥ 20 N/mm²","termoz CS 8","fischer","šroubovací",0.6,60,"14/0372","C","vápenopísková děrovaná cihla s β ≥ 20 N/mm²",1.4,20,null,0.9,null,"MW","zápustná","NE","0,001 - 0,002 W/K (dle délky hmoždinky)"]
["termoz CS 8_vápenopísková děrovaná cihla s β ≥ 12 N/mm²","termoz CS 8","fischer","šroubovací",0.6,60,"14/0372","C","vápenopísková děrovaná cihla s β ≥ 12 N/mm²",1.4,12,null,0.5,null,"MW","zápustná",{"$f":"IF(ISERROR(VLOOKUP(izolant&montáž&B65&talířek,Rpanely,6,)),\"NE\",\"ANO\")","v":"NE"},"0,001 - 0,002 W/K (dle délky hmoždinky)"]
["termoz CS 8_děrovaná pálená cihla s β ≥ 48 N/mm²","termoz CS 8","fischer","šroubovací",0.6,60,"14/0372","C","děrovaná pálená cihla s β ≥ 48 N/mm²",1.6,48,null,1.5,null,"MW","zápustná","NE","0,001 - 0,002 W/K (dle délky hmoždinky)"]
["termoz CS 8_děrovaná pálená cihla s β ≥ 12 N/mm²","termoz CS 8","fischer","šroubovací",0.6,60,"14/0372","C","děrovaná pálená cihla s β ≥ 12 N/mm²",1,12,null,0.6,null,"MW","zápustná","NE","0,001 - 0,002 W/K (dle délky hmoždinky)"]
["termoz CS 8_děrované bloky z lehčeného betonu s β ≥ 10 N/mm²","termoz CS 8","fischer","šroubovací",0.6,60,"14/0372","D","děrované bloky z lehčeného betonu s β ≥ 10 N/mm²",1.2,10,null,1.2,null,"MW","zápustná","NE","0,001 - 0,002 W/K (dle délky hmoždinky)"]
["termoz CS 8_děrované bloky z lehčeného betonu s β ≥ 8 N/mm²","termoz CS 8","fischer","šroubovací",0.6,60,"14/0372","D","děrované bloky z lehčeného betonu s β ≥ 8 N/mm²",1.2,8,null,0.9,null,"MW","zápustná","NE","0,001 - 0,002 W/K (dle délky hmoždinky)"]
["termoz CS 8_děrované bloky z lehčeného betonu s β ≥ 6 N/mm²","termoz CS 8","fischer","šroubovací",0.6,60,"14/0372","D","děrované bloky z lehčeného betonu s β ≥ 6 N/mm²",1.2,6,null,0.75,null,"MW","zápustná","NE","0,001 - 0,002 W/K (dle délky hmoždinky)"]
["termoz CS 8_děrované bloky z lehčeného betonu s β ≥ 4 N/mm²","termoz CS 8","fischer","šroubovací",0.6,60,"14/0372","D","děrované bloky z lehčeného betonu s β ≥ 4 N/mm²",1.2,4,null,0.5,null,"MW","zápustná","NE","0,001 - 0,002 W/K (dle délky hmoždinky)"]
["termoz CS 8_děrované bloky z lehčeného betonu s β ≥ 4 N/mm²","termoz CS 8","fischer","šroubovací",0.6,60,"14/0372","D","děrované bloky z lehčeného betonu s β ≥ 4 N/mm²",0.9,4,null,0.5,null,"MW","zápustná","NE","0,001 - 0,002 W/K (dle délky hmoždinky)"]
["termoz CS 8_lehčený beton s kamenivem","termoz CS 8","fischer","šroubovací",0.6,60,"14/0372","D","lehčený beton s kamenivem",0.9,6,null,0.75,null,"MW","zápustná","NE","0,001 - 0,002 W/K (dle délky hmoždinky)"]
["termoz CS 8_pórobeton P4","termoz CS 8","fischer","šroubovací",0.6,60,"14/0372","E","pórobeton P4",0.5,4,null,0.6,null,"MW","zápustná","NE","0,001 - 0,002 W/K (dle délky hmoždinky)"]
[{"$f":"B75&\"_\"&I75","v":"PTH-S_beton C12/15"},"PTH-S","Bravoll","šroubovací",0.9,60,"08/0267","A","beton C12/15",null,null,null,1.5,null,"MW","povrchová",{"$f":"IF(ISERROR(VLOOKUP(izolant&montáž&B75&talířek,Rpanely,6,)),\"NE\",\"ANO\")","v":"NE"},2E-3]
["PTH-S_beton C16/20-C50/60","PTH-S","Bravoll","šroubovací",0.9,60,"08/0267","A","beton C16/20-C50/60",null,null,null,1.5,null,"MW","povrchová","NE",2E-3]
["PTH-S_plná pálená cihla","PTH-S","Bravoll","šroubovací",0.9,60,"08/0267","B","plná pálená cihla",1.7,20,null,1.5,null,"MW","povrchová","NE",2E-3]
["PTH-S_vápenopísková cihla","PTH-S","Bravoll","šroubovací",0.9,60,"08/0267","B","vápenopísková cihla",1.8,12,null,1.2,null,"MW","povrchová","NE",2E-3]
["PTH-S_dutinové tvárnice z lehčeného betonu","PTH-S","Bravoll","šroubovací",0.9,60,"08/0267","D","dutinové tvárnice z lehčeného betonu",0.5,4,null,1.5,null,"MW","povrchová","NE",2E-3]
["PTH-S_lehčený beton s pórovitým kamenivem (LAC)","PTH-S","Bravoll","šroubovací",0.9,60,"08/0267","D","lehčený beton s pórovitým kamenivem (LAC)",1.2,4,null,1,null,"MW","povrchová","NE",2E-3]
["PTH-S_děrovaná cihla s hliněným střepem","PTH-S","Bravoll","šroubovací",0.9,60,"08/0267","C","děrovaná cihla s hliněným střepem",0.7,10,null,0.75,null,"MW","povrchová","NE",2E-3]
["PTH-S_vertikálně děrovaná cihla s hliněným střepem dle ÖNORM B6124","PTH-S","Bravoll","šroubovací",0.9,60,"08/0267","C","vertikálně děrovaná cihla s hliněným střepem dle ÖNORM B6124",0.9,10,null,0.6,null,"MW","povrchová","NE",2E-3]
["PTH-S_pórobeton P2-400","PTH-S","Bravoll","šroubovací",0.9,60,"08/0267","E","pórobeton P2-400",0.4,2,null,0.6,null,"MW","povrchová","NE",2E-3]
[{"$f":"B84&\"_\"&I84","v":"PTH-S_beton C12/15"},"PTH-S","Bravoll","šroubovací",0.9,60,"08/0267","A","beton C12/15",null,null,null,1.5,null,"MW","zápustná","NE",2E-3]
[{"$f":"B85&\"_\"&I85","v":"PTH-S_beton C16/20-C50/60"},"PTH-S","Bravoll","šroubovací",0.9,60,"08/0267","A","beton C16/20-C50/60",null,null,null,1.5,null,"MW","zápustná","NE",2E-3]
["PTH-S_plná pálená cihla","PTH-S","Bravoll","šroubovací",0.9,60,"08/0267","B","plná pálená cihla",1.7,20,null,1.5,null,"MW","zápustná","NE",2E-3]
["PTH-S_vápenopísková cihla","PTH-S","Bravoll","šroubovací",0.9,60,"08/0267","B","vápenopísková cihla",1.8,12,null,1.2,null,"MW","zápustná","NE",2E-3]
["PTH-S_dutinové tvárnice z lehčeného betonu","PTH-S","Bravoll","šroubovací",0.9,60,"08/0267","D","dutinové tvárnice z lehčeného betonu",0.5,4,null,1.5,null,"MW","zápustná","NE",2E-3]
["PTH-S_lehčený beton s pórovitým kamenivem (LAC)","PTH-S","Bravoll","šroubovací",0.9,60,"08/0267","D","lehčený beton s pórovitým kamenivem (LAC)",1.2,4,null,1,null,"MW","zápustná","NE",2E-3]
["PTH-S_děrovaná cihla s hliněným střepem","PTH-S","Bravoll","šroubovací",0.9,60,"08/0267","C","děrovaná cihla s hliněným střepem",0.7,10,null,0.75,null,"MW","zápustná","NE",2E-3]
["PTH-S_vertikálně děrovaná cihla s hliněným střepem dle ÖNORM B6124","PTH-S","Bravoll","šroubovací",0.9,60,"08/0267","C","vertikálně děrovaná cihla s hliněným střepem dle ÖNORM B6124",0.9,10,null,0.6,null,"MW","zápustná","NE",2E-3]
["PTH-S_pórobeton P2-400","PTH-S","Bravoll","šroubovací",0.9,60,"08/0267","E","pórobeton P2-400",0.4,2,null,0.6,null,"MW","zápustná","NE",2E-3]
["PTH-KZ_beton C12/15","PTH-KZ","Bravoll","zatloukací",0.7,60,"05/0055","A","beton C12/15",null,null,null,0.7,null,"MW","povrchová","NE",2E-3]
["PTH-KZ_beton C16/20-C50/60","PTH-KZ","Bravoll","zatloukací",0.7,60,"05/0055","A","beton C16/20-C50/60",null,null,null,0.9,null,"MW","povrchová","NE",2E-3]
["PTH-KZ_plná pálená cihla","PTH-KZ","Bravoll","zatloukací",0.7,60,"05/0055","B","plná pálená cihla",1.7,20,null,0.9,null,"MW","povrchová","NE",2E-3]
["PTH-KZ_vápenopísková cihla","PTH-KZ","Bravoll","zatloukací",0.7,60,"05/0055","B","vápenopísková cihla",1.8,12,null,0.9,null,"MW","povrchová","NE",2E-3]
["PTH-KZ_dutinové tvárnice z lehčeného betonu","PTH-KZ","Bravoll","zatloukací",0.7,60,"05/0055","D","dutinové tvárnice z lehčeného betonu",0.5,4,null,0.9,null,"MW","povrchová","NE",2E-3]
["PTH-KZ_lehčený beton s pórovitým kamenivem (LAC)","PTH-KZ","Bravoll","zatloukací",0.7,60,"05/0055","D","lehčený beton s pórovitým kamenivem (LAC)",1.2,4,null,0.9,null,"MW","povrchová","NE",2E-3]
["PTH-KZ_děrovaná cihla s hliněným střepem","PTH-KZ","Bravoll","zatloukací",0.7,60,"05/0055","C","děrovaná cihla s hliněným střepem",0.7,12,null,0.3,null,"MW","povrchová","NE",2E-3]
["PTH-KZ_vertikálně děrovaná cihla s hliněným střepem dle ÖNORM B6124","PTH-KZ","Bravoll","zatloukací",0.7,60,"05/0055","C","vertikálně děrovaná cihla s hliněným střepem dle ÖNORM B6124",0.9,15,null,0.5,null,"MW","povrchová","NE",2E-3]
["PTH-EX_beton C12/15","PTH-EX","Bravoll","zatloukací",0.6,60,"13/0951","A","beton C12/15",null,null,null,0.9,null,"MW","povrchová",{"$f":"IF(ISERROR(VLOOKUP(izolant&montáž&B101&talířek,Rpanely,6,)),\"NE\",\"ANO\")","v":"NE"},1E-3]
["PTH-EX_beton C16/20-C50/60","PTH-EX","Bravoll","zatloukací",0.6,60,"13/0951","A","beton C16/20-C50/60",null,null,null,1.2,null,"MW","povrchová","NE",1E-3]
["PTH-EX_plná pálená cihla","PTH-EX","Bravoll","zatloukací",0.6,60,"13/0951","B","plná pálená cihla",1.7,20,null,0.9,null,"MW","povrchová","NE",1E-3]
["PTH-EX_vápenopísková cihla","PTH-EX","Bravoll","zatloukací",0.6,60,"13/0951","B","vápenopísková cihla",1.8,12,null,0.9,null,"MW","povrchová","NE",1E-3]
["PTH-EX_dutinové tvárnice z lehčeného betonu","PTH-EX","Bravoll","zatloukací",0.6,60,"13/0951","D","dutinové tvárnice z lehčeného betonu",0.5,4,null,0.75,null,"MW","povrchová","NE",1E-3]
["PTH-EX_lehčený beton s pórovitým kamenivem (LAC)","PTH-EX","Bravoll","zatloukací",0.6,60,"13/0951","D","lehčený beton s pórovitým kamenivem (LAC)",1.2,4,null,0.6,null,"MW","povrchová","NE",1E-3]
["PTH-EX_děrovaná cihla s hliněným střepem","PTH-EX","Bravoll","zatloukací",0.6,60,"13/0951","C","děrovaná cihla s hliněným střepem",0.7,12,null,0.6,null,"MW","povrchová","NE",1E-3]
["PTH-EX_vertikálně děrovaná cihla s hliněným střepem dle ÖNORM B6124","PTH-EX","Bravoll","zatloukací",0.6,60,"13/0951","C","vertikálně děrovaná cihla s hliněným střepem dle ÖNORM B6124",0.9,15,null,0.75,null,"MW","povrchová","NE",1E-3]
[{"$f":"B109&\"_\"&I109","v":"STR U 2G_beton C12/15-C50/60"},"STR U 2G","Ejot","šroubovací",0.6,60,"04/0023","A","beton C12/15-C50/60",null,null,null,1.5,1.5,"MW","povrchová","NE",2E-3]
["STR U 2G_tenké betonové desky C16/20-C50/60 100mm>h≥40mm","STR U 2G","Ejot","šroubovací",0.6,60,"04/0023","A","tenké betonové desky C16/20-C50/60 100mm>h≥40mm",null,null,null,1.5,1.6,"MW","povrchová","NE",2E-3]
["STR U 2G_plná pálená cihla","STR U 2G","Ejot","šroubovací",0.6,60,"04/0023","B","plná pálená cihla",1.8,12,null,1.5,2.1,"MW","povrchová","NE",2E-3]
["STR U 2G_plná vápenopísková tvárnice","STR U 2G","Ejot","šroubovací",0.6,60,"04/0023","B","plná vápenopísková tvárnice",1.8,12,null,1.5,2.1,"MW","povrchová","NE",2E-3]
["STR U 2G_tvárnice z lehčeného betonu","STR U 2G","Ejot","šroubovací",0.6,60,"04/0023","B","tvárnice z lehčeného betonu",0.9,4,null,0.6,2.1,"MW","povrchová","NE",2E-3]
["STR U 2G_děrovaná cihla","STR U 2G","Ejot","šroubovací",0.6,60,"04/0023","C","děrovaná cihla",1.2,12,null,1.2,1.8,"MW","povrchová","NE",2E-3]
["STR U 2G_děrovaná vápenopísková tvárnice","STR U 2G","Ejot","šroubovací",0.6,60,"04/0023","C","děrovaná vápenopísková tvárnice",1.6,2,null,1.5,1.8,"MW","povrchová","NE",2E-3]
["STR U 2G_děrovaná tvárnice z lehčeného betonu","STR U 2G","Ejot","šroubovací",0.6,60,"04/0023","C","děrovaná tvárnice z lehčeného betonu",0.5,2,null,0.6,1.8,"MW","povrchová","NE",2E-3]
["STR U 2G_mezerovitý lehčený beton LAC","STR U 2G","Ejot","šroubovací",0.6,60,"04/0023","D","mezerovitý lehčený beton LAC",1.8,4,null,0.9,2.4,"MW","povrchová","NE",2E-3]
["STR U 2G_pórobeton P2 - P7","STR U 2G","Ejot","šroubovací",0.6,60,"04/0023","E","pórobeton P2 - P7",0.4,2,null,0.75,1.8,"MW","povrchová","NE",2E-3]
["STR U 2G_beton C12/15-C50/60","STR U 2G","Ejot","šroubovací",0.6,60,"04/0023","A","beton C12/15-C50/60",null,null,null,1.5,1.5,"MW","zápustná","NE",1E-3]
["STR U 2G_tenké betonové desky C16/20-C50/60 100mm>h≥40mm","STR U 2G","Ejot","šroubovací",0.6,60,"04/0023","A","tenké betonové desky C16/20-C50/60 100mm>h≥40mm",null,null,null,1.5,1.6,"MW","zápustná","NE",1E-3]
["STR U 2G_plná pálená cihla","STR U 2G","Ejot","šroubovací",0.6,60,"04/0023","B","plná pálená cihla",1.8,12,null,1.5,2.1,"MW","zápustná","NE",1E-3]
["STR U 2G_plná vápenopísková tvárnice","STR U 2G","Ejot","šroubovací",0.6,60,"04/0023","B","plná vápenopísková tvárnice",1.8,12,null,1.5,2.1,"MW","zápustná","NE",1E-3]
["STR U 2G_tvárnice z lehčeného betonu","STR U 2G","Ejot","šroubovací",0.6,60,"04/0023","B","tvárnice z lehčeného betonu",0.9,4,null,0.6,2.1,"MW","zápustná","NE",1E-3]
["STR U 2G_děrovaná cihla","STR U 2G","Ejot","šroubovací",0.6,60,"04/0023","C","děrovaná cihla",1.2,12,null,1.2,1.8,"MW","zápustná","NE",1E-3]
["STR U 2G_děrovaná vápenopísková tvárnice","STR U 2G","Ejot","šroubovací",0.6,60,"04/0023","C","děrovaná vápenopísková tvárnice",1.6,2,null,1.5,1.8,"MW","zápustná","NE",1E-3]
["STR U 2G_děrovaná tvárnice z lehčeného betonu","STR U 2G","Ejot","šroubovací",0.6,60,"04/0023","C","děrovaná tvárnice z lehčeného betonu",0.5,2,null,0.6,1.8,"MW","zápustná","NE",1E-3]
["STR U 2G_mezerovitý lehčený beton LAC","STR U 2G","Ejot","šroubovací",0.6,60,"04/0023","D","mezerovitý lehčený beton LAC",1.8,4,null,0.9,2.4,"MW","zápustná","NE",1E-3]
["STR U 2G_pórobeton P2 - P7","STR U 2G","Ejot","šroubovací",0.6,60,"04/0023","E","pórobeton P2 - P7",0.4,2,null,0.75,1.8,"MW","zápustná","NE",1E-3]
["H1 eco_beton C12/15","H1 eco","Ejot","zatloukací",0.6,60,"11/0192","A","beton C12/15",null,null,null,0.9,2.1,"MW","povrchová","NE",1E-3]
["H1 eco_beton C20/25 - C50/60","H1 eco","Ejot","zatloukací",0.6,60,"11/0192","A","beton C20/25 - C50/60",null,null,null,0.9,2.1,"MW","povrchová","NE",1E-3]
["H1 eco_plná pálená cihla","H1 eco","Ejot","zatloukací",0.6,60,"11/0192","B","plná pálená cihla",1.8,12,null,0.9,2.9,"MW","povrchová","NE",1E-3]
["H1 eco_plná vápenopísková tvárnice","H1 eco","Ejot","zatloukací",0.6,60,"11/0192","B","plná vápenopísková tvárnice",1.8,12,null,0.9,2.9,"MW","povrchová","NE",1E-3]
["H1 eco_děrovaná cihla","H1 eco","Ejot","zatloukací",0.6,60,"11/0192","C","děrovaná cihla",1.2,20,null,0.75,2.5,"MW","povrchová","NE",1E-3]
["H1 eco_děrovaná cihla","H1 eco","Ejot","zatloukací",0.6,60,"11/0192","C","děrovaná cihla",0.9,12,null,0.6,2.5,"MW","povrchová",{"$f":"IF(ISERROR(VLOOKUP(izolant&montáž&B134&talířek,Rpanely,6,)),\"NE\",\"ANO\")","v":"NE"},1E-3]
["H1 eco_děrovaná vápenopísková tvárnice","H1 eco","Ejot","zatloukací",0.6,60,"11/0192","C","děrovaná vápenopísková tvárnice",1.4,12,null,0.9,2.5,"MW","povrchová","NE",1E-3]
[{"$f":"B136&\"_\"&I136","v":"TFIX-8M_beton C12/15-C50/60"},"TFIX-8M","Koelner","zatloukací",1,60,"07/0336","A","beton C12/15-C50/60",2,12,null,1.2,null,"MW","povrchová","NE",2E-3]
["TFIX-8M_plná vápenopísková cihla","TFIX-8M","Koelner","zatloukací",1,60,"07/0336","B","plná vápenopísková cihla",1.6,12,null,1.2,null,"MW","povrchová","NE",2E-3]
["TFIX-8M_plná pálená cihla","TFIX-8M","Koelner","zatloukací",1,60,"07/0336","B","plná pálená cihla",1.6,12,null,1.2,null,"MW","povrchová","NE",2E-3]
["TFIX-8M_vertikálně děrovaná vápenopísková cihla","TFIX-8M","Koelner","zatloukací",1,60,"07/0336","C","vertikálně děrovaná vápenopísková cihla",1.4,12,null,0.9,null,"MW","povrchová","NE",2E-3]
["TFIX-8M_vertikálně děrovaná cihla s hliněným střepem","TFIX-8M","Koelner","zatloukací",1,60,"07/0336","C","vertikálně děrovaná cihla s hliněným střepem",1.2,12,null,0.6,null,"MW","povrchová","NE",2E-3]
["TFIX-8M_dutinové tvárnice z lehčeného betonu","TFIX-8M","Koelner","zatloukací",1,60,"07/0336","C","dutinové tvárnice z lehčeného betonu",0.5,4,null,0.5,null,"MW","povrchová","NE",2E-3]
["TFIX-8M_tvárnice z lehčeného betonu","TFIX-8M","Koelner","zatloukací",1,60,"07/0336","C","tvárnice z lehčeného betonu",0.5,2,null,0.3,null,"MW","povrchová","NE",2E-3]
["TFIX-8S_beton C12/15","TFIX-8S","Koelner","šroubovací",0.6,60,"11/0144","A","beton C12/15",null,null,null,1.2,null,"MW","povrchová","NE",2E-3]
["TFIX-8S_beton C16/20","TFIX-8S","Koelner","šroubovací",0.6,60,"11/0144","A","beton C16/20",null,null,null,1.2,null,"MW","povrchová","NE",2E-3]
["TFIX-8S_beton C50/60","TFIX-8S","Koelner","šroubovací",0.6,60,"11/0144","A","beton C50/60",null,null,null,1.2,null,"MW","povrchová","NE",2E-3]
["TFIX-8S_plná vápenopísková cihla","TFIX-8S","Koelner","šroubovací",0.6,60,"11/0144","B","plná vápenopísková cihla",1.8,12,null,1.2,null,"MW","povrchová","NE",2E-3]
["TFIX-8S_plná pálená cihla","TFIX-8S","Koelner","šroubovací",0.6,60,"11/0144","B","plná pálená cihla",2,12,null,1.2,null,"MW","povrchová","NE",2E-3]
["TFIX-8S_vertikálně děrovaná vápenopísková cihla","TFIX-8S","Koelner","šroubovací",0.6,60,"11/0144","C","vertikálně děrovaná vápenopísková cihla",1.4,12,null,0.75,null,"MW","povrchová","NE",2E-3]
["TFIX-8S_vertikálně děrovaná cihla s hliněným střepem","TFIX-8S","Koelner","šroubovací",0.6,60,"11/0144","C","vertikálně děrovaná cihla s hliněným střepem",1,12,null,0.75,null,"MW","povrchová","NE",2E-3]
["TFIX-8S_lehký beton s kamenivem","TFIX-8S","Koelner","šroubovací",0.6,60,"11/0144","D","lehký beton s kamenivem",1.4,8,null,0.6,null,"MW","povrchová","NE",2E-3]
["TFIX-8S_lehké betonové děrované bloky","TFIX-8S","Koelner","šroubovací",0.6,60,"11/0144","D","lehké betonové děrované bloky",1.2,10,null,0.6,null,"MW","povrchová","NE",2E-3]
["TFIX-8S_lehké betonové plné bloky","TFIX-8S","Koelner","šroubovací",0.6,60,"11/0144","D","lehké betonové plné bloky",0.8,6,null,0.5,null,"MW","povrchová","NE",2E-3]
["TFIX-8S_pórobeton P4","TFIX-8S","Koelner","šroubovací",0.6,60,"11/0144","E","pórobeton P4",0.5,4,"hl. kotvení 65mm",0.9,null,"MW","povrchová","NE",2E-3]
["TFIX-8ST_beton C12/15","TFIX-8ST","Koelner","šroubovací",0.6,60,"11/0144","A","beton C12/15",null,null,null,1.2,null,"MW","zápustná","NE",1E-3]
["TFIX-8ST_beton C16/20","TFIX-8ST","Koelner","šroubovací",0.6,60,"11/0144","A","beton C16/20",null,null,null,1.2,null,"MW","zápustná","NE",1E-3]
["TFIX-8ST_beton C50/60","TFIX-8ST","Koelner","šroubovací",0.6,60,"11/0144","A","beton C50/60",null,null,null,1.2,null,"MW","zápustná","NE",1E-3]
["TFIX-8ST_plná vápenopísková cihla","TFIX-8ST","Koelner","šroubovací",0.6,60,"11/0144","B","plná vápenopísková cihla",1.8,12,null,1.2,null,"MW","zápustná","NE",1E-3]
["TFIX-8ST_plná pálená cihla","TFIX-8ST","Koelner","šroubovací",0.6,60,"11/0144","B","plná pálená cihla",2,12,null,1.2,null,"MW","zápustná","NE",1E-3]
["TFIX-8ST_plná vápenopísková cihla s β ≥ 20 N/mm²","TFIX-8ST","Koelner","šroubovací",0.6,60,"11/0144","B","plná vápenopísková cihla s β ≥ 20 N/mm²",2,20,null,0.9,null,"MW","zápustná","NE",1E-3]
["TFIX-8ST_plná vápenopísková cihla s β ≥ 12 N/mm²","TFIX-8ST","Koelner","šroubovací",0.6,60,"11/0144","B","plná vápenopísková cihla s β ≥ 12 N/mm²",2,12,null,0.9,null,"MW","zápustná","NE",1E-3]
["TFIX-8ST_plné betonové bloky s β ≥ 20 N/mm²","TFIX-8ST","Koelner","šroubovací",0.6,60,"11/0144","B","plné betonové bloky s β ≥ 20 N/mm²",2,20,null,1.5,null,"MW","zápustná",{"$f":"IF(ISERROR(VLOOKUP(izolant&montáž&B161&talířek,Rpanely,6,)),\"NE\",\"ANO\")","v":"NE"},1E-3]
["TFIX-8ST_plné betonové bloky s β ≥ 12 N/mm²","TFIX-8ST","Koelner","šroubovací",0.6,60,"11/0144","B","plné betonové bloky s β ≥ 12 N/mm²",2,12,null,1.2,null,"MW","zápustná","NE",1E-3]
["TFIX-8ST_plné bloky z lehčeného betonu","TFIX-8ST","Koelner","šroubovací",0.6,60,"11/0144","B","plné bloky z lehčeného betonu",1.4,8,null,0.5,null,"MW","zápustná","NE",1E-3]
["TFIX-8ST_vertikálně děrovaná vápenopísková cihla","TFIX-8ST","Koelner","šroubovací",0.6,60,"11/0144","C","vertikálně děrovaná vápenopísková cihla",1.4,12,null,0.9,null,"MW","zápustná","NE",1E-3]
["TFIX-8ST_vertikálně děrovaná cihla s hliněným střepem","TFIX-8ST","Koelner","šroubovací",0.6,60,"11/0144","C","vertikálně děrovaná cihla s hliněným střepem",1,12,null,0.9,null,"MW","zápustná","NE",1E-3]
["TFIX-8ST_děrovaná pálená cihla","TFIX-8ST","Koelner","šroubovací",0.6,60,"11/0144","C","děrovaná pálená cihla",1,12,null,0.75,null,"MW","zápustná","NE",1E-3]
["TFIX-8ST_lehký beton s kamenivem","TFIX-8ST","Koelner","šroubovací",0.6,60,"11/0144","D","lehký beton s kamenivem",1.4,8,null,0.6,null,"MW","zápustná","NE",1E-3]
["TFIX-8ST_lehké betonové děrované bloky","TFIX-8ST","Koelner","šroubovací",0.6,60,"11/0144","D","lehké betonové děrované bloky",1.2,10,null,0.6,null,"MW","zápustná","NE",1E-3]
["TFIX-8ST_lehké betonové plné bloky","TFIX-8ST","Koelner","šroubovací",0.6,60,"11/0144","D","lehké betonové plné bloky",0.8,6,null,0.5,null,"MW","zápustná","NE",1E-3]
["TFIX-8ST_pórobeton P4","TFIX-8ST","Koelner","šroubovací",0.6,60,"11/0144","E","pórobeton P4",0.5,4,"hl. kotvení 65mm",0.9,null,"MW","zápustná","NE",1E-3]
[{"$f":"B171&\"_\"&I171","v":"WKTHERM 8_beton C12/15"},"WKTHERM 8","Wkret-met","zatloukací",0.6,60,"ETA-11/0232","A","beton C12/15",null,null,"protokol o zkoušce = 060-041299",1.2,null,"MW","povrchová",{"$f":"IF(ISERROR(VLOOKUP(izolant&montáž&B171&talířek,Rpanely,6,)),\"NE\",\"ANO\")","v":"NE"},2E-3]
["WKTHERM 8_beton C50/60","WKTHERM 8","Wkret-met","zatloukací",0.6,60,"ETA-11/0232","A","beton C50/60",null,null,"protokol o zkoušce = 060-041299",1.5,null,"MW","povrchová","NE",2E-3]
["WKTHERM 8_plná pálená cihla","WKTHERM 8","Wkret-met","zatloukací",0.6,60,"ETA-11/0232","B","plná pálená cihla",1.7,30,"protokol o zkoušce = 060-041299",1.5,null,"MW","povrchová","NE",2E-3]
["WKTHERM 8_plná vápenopísková cihla","WKTHERM 8","Wkret-met","zatloukací",0.6,60,"ETA-11/0232","B","plná vápenopísková cihla",2,20,"protokol o zkoušce = 060-041299",1.5,null,"MW","povrchová","NE",2E-3]
["WKTHERM 8_vertikálně děrovaná vápenopísková cihla","WKTHERM 8","Wkret-met","zatloukací",0.6,60,"ETA-11/0232","C","vertikálně děrovaná vápenopísková cihla",1.6,12,"protokol o zkoušce = 060-041299",1.2,null,"MW","povrchová","NE",2E-3]
["WKTHERM 8_vertikálně děrovaná cihla s hliněným střepem","WKTHERM 8","Wkret-met","zatloukací",0.6,60,"ETA-11/0232","C","vertikálně děrovaná cihla s hliněným střepem",0.8,15,"protokol o zkoušce = 060-041299",0.6,null,"MW","povrchová","NE",2E-3]
["WKTHERM 8S_beton C12/15","WKTHERM 8S","Wkret-met","šroubovací",0.6,60,"ETA-13/0734","A","beton C12/15",null,null,"protokol o zkoušce = 060-041299",1.2,null,"MW","povrchová","NE",2E-3]
["WKTHERM 8S_beton C50/60","WKTHERM 8S","Wkret-met","šroubovací",0.6,60,"ETA-13/0735","A","beton C50/60",null,null,"protokol o zkoušce = 060-041299",1.5,null,"MW","povrchová","NE",2E-3]
[{"$f":"B179&\"_\"&I179","v":"WKTHERM 8S_plná pálená cihla"},"WKTHERM 8S","Wkret-met","šroubovací",0.6,60,"ETA-13/0736","B","plná pálená cihla",2,20,"protokol o zkoušce = 060-041299",1.5,null,"MW","povrchová","NE",2E-3]
["WKTHERM 8S_plná vápenopísková cihla","WKTHERM 8S","Wkret-met","šroubovací",0.6,60,"ETA-13/0737","B","plná vápenopísková cihla",2,20,"protokol o zkoušce = 060-041299",1.5,null,"MW","povrchová","NE",2E-3]
["WKTHERM 8S_vertikálně děrovaná vápenopísková cihla","WKTHERM 8S","Wkret-met","šroubovací",0.6,60,"ETA-13/0738","C","vertikálně děrovaná vápenopísková cihla",1.6,12,"protokol o zkoušce = 060-041299",0.9,null,"MW","povrchová","NE",2E-3]
["WKTHERM 8S_vertikálně děrovaná cihla s hliněným střepem","WKTHERM 8S","Wkret-met","šroubovací",0.6,60,"ETA-13/0739","C","vertikálně děrovaná cihla s hliněným střepem",1.2,12,"protokol o zkoušce = 060-041299",0.75,null,"MW","povrchová","NE",2E-3]
["WKTHERM 8S_dutinová tvárnice z lehčeného betonu","WKTHERM 8S","Wkret-met","šroubovací",0.6,60,"ETA-13/0740","D","dutinová tvárnice z lehčeného betonu",0.8,2,"protokol o zkoušce = 060-041299",0.75,null,"MW","povrchová","NE",2E-3]
["WKTHERM 8S_plná tvárnice z lehčeného betonu","WKTHERM 8S","Wkret-met","šroubovací",0.6,60,"ETA-13/0741","D","plná tvárnice z lehčeného betonu",1.05,5,"protokol o zkoušce = 060-041299",0.9,null,"MW","povrchová","NE",2E-3]
["WKTHERM 8S_pórobeton AAC2","WKTHERM 8S","Wkret-met","šroubovací",0.6,60,"ETA-13/0742","E","pórobeton AAC2",0.35,2,"protokol o zkoušce = 060-041299",0.6,null,"MW","povrchová","NE",2E-3]
["WKTHERM 8S_pórobeton AAC7","WKTHERM 8S","Wkret-met","šroubovací",0.6,60,"ETA-13/0743","E","pórobeton AAC7",0.65,3.5,"protokol o zkoušce = 060-041299",1.2,null,"MW","povrchová","NE",2E-3]
["FIXPLUG 8_beton C12/15","FIXPLUG 8","Wkret-met","zatloukací",0.6,60,"ETA-11/0237","A","beton C12/15",null,null,"protokol o zkoušce = 060-041299",0.75,null,"MW","povrchová","NE",2E-3]
["FIXPLUG 8_beton C50/60","FIXPLUG 8","Wkret-met","zatloukací",0.6,60,"ETA-11/0238","A","beton C50/60",null,null,"protokol o zkoušce = 060-041299",0.9,null,"MW","povrchová","NE",2E-3]
["FIXPLUG 8_plná pálená cihla","FIXPLUG 8","Wkret-met","zatloukací",0.6,60,"ETA-11/0239","B","plná pálená cihla",1.7,30,"protokol o zkoušce = 060-041299",1.5,null,"MW","povrchová","NE",2E-3]
["FIXPLUG 8_plná vápenopísková cihla","FIXPLUG 8","Wkret-met","zatloukací",0.6,60,"ETA-11/0240","B","plná vápenopísková cihla",2,20,"protokol o zkoušce = 060-041299",1.5,null,"MW","povrchová","NE",2E-3]
["FIXPLUG 8_vertikálně děrovaná vápenopísková cihla","FIXPLUG 8","Wkret-met","zatloukací",0.6,60,"ETA-11/0241","C","vertikálně děrovaná vápenopísková cihla",1.6,12,"protokol o zkoušce = 060-041299",0.75,null,"MW","povrchová","NE",2E-3]
["FIXPLUG 8_vertikálně děrovaná cihla s hliněným střepem","FIXPLUG 8","Wkret-met","zatloukací",0.6,60,"ETA-11/0242","C","vertikálně děrovaná cihla s hliněným střepem",0.8,15,"protokol o zkoušce = 060-041299",0.4,null,"MW","povrchová","NE",2E-3]
["eco-drive W_beton C12/15","eco-drive W","Wkret-met","šroubovací",0.6,110,"ETA-13/0724","A","beton C12/15",null,null,"protokol o zkoušce = 060-041299",1.2,null,"MW","zápustná","NE",2E-3]
["eco-drive W_beton C50/60","eco-drive W","Wkret-met","šroubovací",0.6,110,"ETA-13/0725","A","beton C50/60",null,null,"protokol o zkoušce = 060-041299",1.5,null,"MW","zápustná","NE",2E-3]
["eco-drive W_plná pálená cihla","eco-drive W","Wkret-met","šroubovací",0.6,110,"ETA-13/0726","B","plná pálená cihla",2,20,"protokol o zkoušce = 060-041299",1.5,null,"MW","zápustná","NE",2E-3]
["eco-drive W_plná vápenopísková cihla","eco-drive W","Wkret-met","šroubovací",0.6,110,"ETA-13/0727","B","plná vápenopísková cihla",2,20,"protokol o zkoušce = 060-041299",1.5,null,"MW","zápustná",{"$f":"IF(ISERROR(VLOOKUP(izolant&montáž&B196&talířek,Rpanely,6,)),\"NE\",\"ANO\")","v":"NE"},2E-3]
["eco-drive W_vertikálně děrovaná vápenopísková cihla","eco-drive W","Wkret-met","šroubovací",0.6,110,"ETA-13/0728","C","vertikálně děrovaná vápenopísková cihla",1.6,12,"protokol o zkoušce = 060-041299",1.5,null,"MW","zápustná","NE",2E-3]
["eco-drive W_vertikálně děrovaná cihla s hliněným střepem","eco-drive W","Wkret-met","šroubovací",0.6,110,"ETA-13/0729","C","vertikálně děrovaná cihla s hliněným střepem",1.2,12,"protokol o zkoušce = 060-041299",1.5,null,"MW","zápustná","NE",2E-3]
["eco-drive W_dutinová tvárnice z lehčeného betonu","eco-drive W","Wkret-met","šroubovací",0.6,110,"ETA-13/0730","D","dutinová tvárnice z lehčeného betonu",0.8,2,"protokol o zkoušce = 060-041299",1.5,null,"MW","zápustná","NE",2E-3]
["eco-drive W_plná tvárnice z lehčeného betonu","eco-drive W","Wkret-met","šroubovací",0.6,110,"ETA-13/0731","D","plná tvárnice z lehčeného betonu",1.05,5,"protokol o zkoušce = 060-041299",0.9,null,"MW","zápustná","NE",2E-3]
["eco-drive W_pórobeton AAC2","eco-drive W","Wkret-met","šroubovací",0.6,110,"ETA-13/0732","E","pórobeton AAC2",0.35,2,"protokol o zkoušce = 060-041299",0.6,null,"MW","zápustná","NE",2E-3]
[{"$f":"B202&\"_\"&I202","v":"eco-drive W_pórobeton AAC7"},"eco-drive W","Wkret-met","šroubovací",0.6,110,"ETA-13/0733","E","pórobeton AAC7",0.65,3.5,"protokol o zkoušce = 060-041299",1.2,null,"MW","zápustná",{"$f":"IF(ISERROR(VLOOKUP(izolant&montáž&B202&talířek,Rpanely,6,)),\"NE\",\"ANO\")","v":"NE"},2E-3]
[{"$f":"B203&\"_\"&I203","v":"SD-5_beton C12/15"},"SD-5","Hilti","zatloukací",0.6,60,"14/0398","A","beton C12/15",null,null,null,0.9,null,"MW","povrchová",{"$f":"IF(ISERROR(VLOOKUP(izolant&montáž&B203&talířek,Rpanely,6,)),\"NE\",\"ANO\")","v":"NE"},0]
["SD-5_beton C16/20-C50/60","SD-5","Hilti","zatloukací",0.6,60,"14/0398","A","beton C16/20-C50/60",null,null,null,0.9,null,"MW","povrchová","NE",0]
["SD-5_plná pálená cihla","SD-5","Hilti","zatloukací",0.6,60,"14/0398","B","plná pálená cihla",2,12,null,0.9,null,"MW","povrchová","NE",0]
["SD-5_vápenopísková cihla","SD-5","Hilti","zatloukací",0.6,60,"14/0398","B","vápenopísková cihla",1.8,12,null,0.9,null,"MW","povrchová","NE",0]
["SD-5_děrovaná cihla s hliněným střepem","SD-5","Hilti","zatloukací",0.6,60,"14/0398","C","děrovaná cihla s hliněným střepem",1.6,20,null,0.75,null,"MW","povrchová","NE",0]
["SD-5_lehčený beton s pórovitým kamenivem (LAC)","SD-5","Hilti","zatloukací",0.6,60,"14/0398","D","lehčený beton s pórovitým kamenivem (LAC)",1.4,4,null,0.6,null,"MW","povrchová","NE",0]
["SD-5_pórobeton PP4","SD-5","Hilti","zatloukací",0.6,60,"14/0398","E","pórobeton PP4",0.5,4,null,0.4,null,"MW","povrchová","NE",0]
["SDX-8_beton C12/15","SDX-8","Hilti","zatloukací",0.6,60,"14/0399","A","beton C12/15",null,null,null,0.9,null,"MW","povrchová","NE",0]
["SDX-8_beton C16/20-C50/60","SDX-8","Hilti","zatloukací",0.6,60,"14/0399","A","beton C16/20-C50/60",null,null,null,0.9,null,"MW","povrchová","NE",0]
["SDX-8_plná pálená cihla","SDX-8","Hilti","zatloukací",0.6,60,"14/0399","B","plná pálená cihla",2,12,null,0.9,null,"MW","povrchová","NE",0]
["SDX-8_vápenopísková cihla","SDX-8","Hilti","zatloukací",0.6,60,"14/0399","B","vápenopísková cihla",1.8,12,null,0.9,null,"MW","povrchová","NE",0]
["SDX-8_děrovaná cihla s hliněným střepem","SDX-8","Hilti","zatloukací",0.6,60,"14/0399","C","děrovaná cihla s hliněným střepem",1.6,20,null,0.75,null,"MW","povrchová","NE",0]
["SDX-8_lehčený beton s pórovitým kamenivem (LAC)","SDX-8","Hilti","zatloukací",0.6,60,"14/0399","D","lehčený beton s pórovitým kamenivem (LAC)",1.4,4,null,0.6,null,"MW","povrchová","NE",0]
["SDX-8_pórobeton PP4","SDX-8","Hilti","zatloukací",0.6,60,"14/0399","E","pórobeton PP4",0.5,4,null,0.4,null,"MW","povrchová","NE",0]
["HTS-P_beton C12/15","HTS-P","Hilti","zatloukací",0.6,60,"14/0400","A","beton C12/15",null,null,null,0.9,null,"MW","povrchová","NE",0]
["HTS-P_beton C16/20-C50/60","HTS-P","Hilti","zatloukací",0.6,60,"14/0400","A","beton C16/20-C50/60",null,null,null,0.9,null,"MW","povrchová","NE",0]
["HTS-P_plná pálená cihla","HTS-P","Hilti","zatloukací",0.6,60,"14/0400","B","plná pálená cihla",2,12,null,0.9,null,"MW","povrchová","NE",0]
["HTS-P_vápenopísková cihla","HTS-P","Hilti","zatloukací",0.6,60,"14/0400","B","vápenopísková cihla",1.8,12,null,0.9,null,"MW","povrchová","NE",0]
["HTS-P_děrovaná cihla s hliněným střepem","HTS-P","Hilti","zatloukací",0.6,60,"14/0400","C","děrovaná cihla s hliněným střepem",1.6,20,null,0.75,null,"MW","povrchová","NE",0]
["HTS-P_lehčený beton s pórovitým kamenivem (LAC)","HTS-P","Hilti","zatloukací",0.6,60,"14/0400","D","lehčený beton s pórovitým kamenivem (LAC)",1.4,4,null,0.6,null,"MW","povrchová","NE",0]
["HTS-P_pórobeton PP4","HTS-P","Hilti","zatloukací",0.6,60,"14/0400","E","pórobeton PP4",0.5,4,null,0.4,null,"MW","povrchová","NE",0]
["Helix D 8-FV_beton C12/15","Helix D 8-FV","Hilti","šroubovací",0.6,75,"07/0288","A","beton C12/15",null,null,null,1.5,null,"MW","zápustná","NE",0]
["Helix D 8-FV_beton C16/20-C50/60","Helix D 8-FV","Hilti","šroubovací",0.6,75,"07/0288","A","beton C16/20-C50/60",null,null,null,1.5,null,"MW","zápustná","NE",0]
["Helix D 8-FV_plná pálená cihla","Helix D 8-FV","Hilti","šroubovací",0.6,75,"07/0288","B","plná pálená cihla",2,12,null,1.5,null,"MW","zápustná","NE",0]
["Helix D 8-FV_děrovaná cihla s hliněným střepem","Helix D 8-FV","Hilti","šroubovací",0.6,75,"07/0288","C","děrovaná cihla s hliněným střepem",1.2,12,null,0.75,null,"MW","zápustná","NE",0]
["Helix D 8-FV_lehčený beton s pórovitým kamenivem (LAC)","Helix D 8-FV","Hilti","šroubovací",0.6,75,"07/0288","D","lehčený beton s pórovitým kamenivem (LAC)",1.2,4,null,1.2,null,"MW","zápustná","NE",0]
["Helix D 8-FV_pórobeton PP4","Helix D 8-FV","Hilti","šroubovací",0.6,75,"07/0288","E","pórobeton PP4",0.6,4,null,0.9,null,"MW","zápustná","NE",0]
["XI-FV_beton C12/15 - C34/45","XI-FV","Hilti","nastřelovací",1,60,"03/0004","A","beton C12/15 - C34/45",null,null,null,1,null,"MW","povrchová","NE",1E-3]
[{"$f":"B231&\"_\"&I231","v":"TSD 8_beton C12/15"},"TSD 8","Kew","zatloukací",0.6,62,"04/0030","A","beton C12/15",null,null,null,0.5,null,"MW","povrchová",{"$f":"IF(ISERROR(VLOOKUP(izolant&montáž&B231&talířek,Rpanely,6,)),\"NE\",\"ANO\")","v":"NE"},2E-3]
["TSD 8_beton C16/20 - C50/60","TSD 8","Kew","zatloukací",0.6,62,"04/0030","A","beton C16/20 - C50/60",null,null,null,0.75,null,"MW","povrchová","NE",2E-3]
["TSD 8_vápenopísk.pl.cihla,podle DIN v 106/EN 771-2","TSD 8","Kew","zatloukací",0.6,62,"04/0030","B","vápenopísk.pl.cihla,podle DIN v 106/EN 771-2",1.8,12,null,0.8,null,"MW","povrchová","NE",2E-3]
["TSD 8_pl.pálená cihla,podle DIN V 105-100/EN771-1","TSD 8","Kew","zatloukací",0.6,62,"04/0030","B","pl.pálená cihla,podle DIN V 105-100/EN771-1",1.8,20,null,0.6,null,"MW","povrchová","NE",2E-3]
["TSD 8_pl.tvárnice z lehčbetonu,podle DIN 18152 ","TSD 8","Kew","zatloukací",0.6,62,"04/0030","B","pl.tvárnice z lehčbetonu,podle DIN 18152 ",0.9,4,null,0.4,null,"MW","povrchová","NE",2E-3]
["TSD 8_příč.děr.cihla,Hlz,podle DIN V105-100/EN771-1","TSD 8","Kew","zatloukací",0.6,62,"04/0030","C","příč.děr.cihla,Hlz,podle DIN V105-100/EN771-1",1,12,null,0.4,null,"MW","povrchová","NE",2E-3]
["TSD 8_vápenopísk.děr..cihla,podle DIN v 106/EN 771-2","TSD 8","Kew","zatloukací",0.6,62,"04/0030","C","vápenopísk.děr..cihla,podle DIN v 106/EN 771-2",1.4,12,null,0.4,null,"MW","povrchová","NE",2E-3]
["TSD 8_příč.děr.cihla,Hlz250x380x235mm,tl.vně.stěny ≥16mm","TSD 8","Kew","zatloukací",0.6,62,"04/0030","C","příč.děr.cihla,Hlz250x380x235mm,tl.vně.stěny ≥16mm",0.8,6,null,0.3,null,"MW","povrchová","NE",2E-3]
["TSD 8_mezer.lehč.beton,LAC 4,podle EN1520","TSD 8","Kew","zatloukací",0.6,62,"04/0030","D","mezer.lehč.beton,LAC 4,podle EN1520",0.9,4,null,0.4,null,"MW","povrchová","NE",2E-3]
["TSD-V 8_beton C12/15","TSD-V 8","Kew","zatloukací",1.24,62,"08/0315","A","beton C12/15",null,null,null,1.2,null,"MW","povrchová","NE",2E-3]
["TSD-V 8_beton C16/20 - C50/60","TSD-V 8","Kew","zatloukací",1.24,62,"08/0315","A","beton C16/20 - C50/60",null,null,null,1.5,null,"MW","povrchová","NE",2E-3]
["TSD-V 8_vápenopísk.pl.cihla,podle DIN v 106/EN 771-2","TSD-V 8","Kew","zatloukací",1.24,62,"08/0315","B","vápenopísk.pl.cihla,podle DIN v 106/EN 771-2",1.8,12,null,1.5,null,"MW","povrchová","NE",2E-3]
["TSD-V 8_pl.pálená cihla,podle DIN V 105-100/EN771-1","TSD-V 8","Kew","zatloukací",1.24,62,"08/0315","B","pl.pálená cihla,podle DIN V 105-100/EN771-1",1.7,12,null,1.5,null,"MW","povrchová","NE",2E-3]
["TSD-V 8_pl.tvárnice z lehčbetonu,podle DIN 18152 ","TSD-V 8","Kew","zatloukací",1.24,62,"08/0315","B","pl.tvárnice z lehčbetonu,podle DIN 18152 ",0.8,2,null,0.6,null,"MW","povrchová","NE",2E-3]
["TSD-V 8_příč.děr.cihla,Hlz,podle DIN V105-100/EN771-1","TSD-V 8","Kew","zatloukací",1.24,62,"08/0315","C","příč.děr.cihla,Hlz,podle DIN V105-100/EN771-1",1,12,null,0.9,null,"MW","povrchová","NE",2E-3]
["TSD-V 8_vápenopísk.děr..cihla,podle DIN v 106/EN 771-2","TSD-V 8","Kew","zatloukací",1.24,62,"08/0315","C","vápenopísk.děr..cihla,podle DIN v 106/EN 771-2",1.4,12,null,1.2,null,"MW","povrchová","NE",2E-3]
["TSD-V 8_dutin.tvárnice z lehč.betonu,DIN V18151-100/EN771-3","TSD-V 8","Kew","zatloukací",1.24,62,"08/0315","C","dutin.tvárnice z lehč.betonu,DIN V18151-100/EN771-3",0.8,2,null,0.6,null,"MW","povrchová","NE",2E-3]
["TSD-V 8_příč.děr.cihla,podle önorm B6124","TSD-V 8","Kew","zatloukací",1.24,62,"08/0315","C","příč.děr.cihla,podle önorm B6124",0.9,12,null,0.75,null,"MW","povrchová","NE",2E-3]
["TSDL-V 8_beton C12/15","TSDL-V 8","Kew","zatloukací",1.24,62,"12/0148","A","beton C12/15",null,null,null,1.2,null,"MW","povrchová","NE",2E-3]
["TSDL-V 8_beton C16/20 - C50/60","TSDL-V 8","Kew","zatloukací",1.24,62,"12/0148","A","beton C16/20 - C50/60",null,null,null,1.5,null,"MW","povrchová","NE",2E-3]
["TSDL-V 8_vápenopísk.pl.cihla,podle DIN v 106/EN 771-2","TSDL-V 8","Kew","zatloukací",1.24,62,"12/0148","B","vápenopísk.pl.cihla,podle DIN v 106/EN 771-2",1.8,12,null,1.5,null,"MW","povrchová","NE",2E-3]
["TSDL-V 8_pl.pálená cihla,podle DIN V 105-100/EN771-1","TSDL-V 8","Kew","zatloukací",1.24,62,"12/0148","B","pl.pálená cihla,podle DIN V 105-100/EN771-1",1.7,12,null,1.5,null,"MW","povrchová","NE",2E-3]
["TSDL-V 8_pl.tvárnice z lehčbetonu,podle DIN 18152 ","TSDL-V 8","Kew","zatloukací",1.24,62,"12/0148","B","pl.tvárnice z lehčbetonu,podle DIN 18152 ",0.8,2,null,0.6,null,"MW","povrchová","NE",2E-3]
["TSDL-V 8_příč.děr.cihla,Hlz,podle DIN V105-100/EN771-1","TSDL-V 8","Kew","zatloukací",1.24,62,"12/0148","C","příč.děr.cihla,Hlz,podle DIN V105-100/EN771-1",1,12,null,0.9,null,"MW","povrchová","NE",2E-3]
["TSDL-V 8_vápenopísk.děr..cihla,podle DIN v 106/EN 771-2","TSDL-V 8","Kew","zatloukací",1.24,62,"12/0148","C","vápenopísk.děr..cihla,podle DIN v 106/EN 771-2",1.4,12,null,1.2,null,"MW","povrchová","NE",2E-3]
["TSDL-V 8_dutin.tvárnice z lehč.betonu,DIN V18151-100/EN771-3","TSDL-V 8","Kew","zatloukací",1.24,62,"12/0148","C","dutin.tvárnice z lehč.betonu,DIN V18151-100/EN771-3",0.8,2,null,0.6,null,"MW","povrchová","NE",2E-3]
["TSDL-V 8_příč.děr.cihla,podle önorm B6124","TSDL-V 8","Kew","zatloukací",1.24,62,"12/0148","C","příč.děr.cihla,podle önorm B6124",0.9,12,null,0.75,null,"MW","povrchová","NE",2E-3]
[{"$f":"B258&\"_\"&I258","v":"TSBD 8_beton C12/15"},"TSBD 8","Kew","šroubovací",1.6,62,"08/0314","A","beton C12/15",null,null,null,1.5,null,"MW","povrchová","NE",3.0000000000000001E-3]
["TSBD 8_beton C16/20 - C50/60","TSBD 8","Kew","šroubovací",1.6,62,"08/0314","A","beton C16/20 - C50/60",null,null,null,1.5,null,"MW","povrchová","NE",3.0000000000000001E-3]
["TSBD 8_vápenopísk.pl.cihla,podle DIN v 106/EN 771-2","TSBD 8","Kew","šroubovací",1.6,62,"08/0314","B","vápenopísk.pl.cihla,podle DIN v 106/EN 771-2",1.8,12,null,1.5,null,"MW","povrchová","NE",3.0000000000000001E-3]
["TSBD 8_pl.pálená cihla,podle DIN V 105-100/EN771-1","TSBD 8","Kew","šroubovací",1.6,62,"08/0314","B","pl.pálená cihla,podle DIN V 105-100/EN771-1",1.7,12,null,1.5,null,"MW","povrchová","NE",3.0000000000000001E-3]
["TSBD 8_pl.tvárnice z lehčbetonu,DIN 18152 ,β>2 N/mm²","TSBD 8","Kew","šroubovací",1.6,62,"08/0314","B","pl.tvárnice z lehčbetonu,DIN 18152 ,β>2 N/mm²",0.8,2,null,0.75,null,"MW","povrchová",{"$f":"IF(ISERROR(VLOOKUP(izolant&montáž&B262&talířek,Rpanely,6,)),\"NE\",\"ANO\")","v":"NE"},3.0000000000000001E-3]
["TSBD 8_pl.tvárnice z lehčbetonu,DIN 18152 ,β>4 N/mm²","TSBD 8","Kew","šroubovací",1.6,62,"08/0314","B","pl.tvárnice z lehčbetonu,DIN 18152 ,β>4 N/mm²",0.8,4,null,1.2,null,"MW","povrchová","NE",3.0000000000000001E-3]
["TSBD 8_příč.děr.cihla,Hlz,podle DIN V105-100/EN771-1","TSBD 8","Kew","šroubovací",1.6,62,"08/0314","C","příč.děr.cihla,Hlz,podle DIN V105-100/EN771-1",1,12,null,0.9,null,"MW","povrchová","NE",3.0000000000000001E-3]
["TSBD 8_vápenopísk.děr..cihla,podle DIN v 106/EN 771-2","TSBD 8","Kew","šroubovací",1.6,62,"08/0314","C","vápenopísk.děr..cihla,podle DIN v 106/EN 771-2",1.4,12,null,1.2,null,"MW","povrchová","NE",3.0000000000000001E-3]
["TSBD 8_dutin.tvárnice z lehč.betonu,DIN V18151-100/EN771-3","TSBD 8","Kew","šroubovací",1.6,62,"08/0314","C","dutin.tvárnice z lehč.betonu,DIN V18151-100/EN771-3",0.8,2,null,0.9,null,"MW","povrchová","NE",3.0000000000000001E-3]
["TSBD 8_příč.děr.cihla,Hlz 250x380x235mm","TSBD 8","Kew","šroubovací",1.6,62,"08/0314","C","příč.děr.cihla,Hlz 250x380x235mm",1,6,null,0.5,null,"MW","povrchová","NE",3.0000000000000001E-3]
["TSBD 8_mezer.lehč.beton, β>4 N/mm², hloubka kotvení 30mm","TSBD 8","Kew","šroubovací",1.6,62,"08/0314","D","mezer.lehč.beton, β>4 N/mm², hloubka kotvení 30mm",1,4,null,0.4,null,"MW","povrchová","NE",3.0000000000000001E-3]
["TSBD 8_mezer.lehč.beton, β>4 N/mm², hloubka kotvení 50mm","TSBD 8","Kew","šroubovací",1.6,62,"08/0314","D","mezer.lehč.beton, β>4 N/mm², hloubka kotvení 50mm",1,4,null,0.9,null,"MW","povrchová","NE",3.0000000000000001E-3]
["TSBD 8_mezer.lehč.beton, β>6 N/mm², hloubka kotvení 30mm","TSBD 8","Kew","šroubovací",1.6,62,"08/0314","D","mezer.lehč.beton, β>6 N/mm², hloubka kotvení 30mm",1,6,null,0.5,null,"MW","povrchová","NE",3.0000000000000001E-3]
["TSBD 8_mezer.lehč.beton, β>6 N/mm², hloubka kotvení 50mm","TSBD 8","Kew","šroubovací",1.6,62,"08/0314","D","mezer.lehč.beton, β>6 N/mm², hloubka kotvení 50mm",1,6,null,1.2,null,"MW","povrchová","NE",3.0000000000000001E-3]
["TSBD 8_porobeton, PP4-0,5, hloubka kotvení 30mm","TSBD 8","Kew","šroubovací",1.6,62,"08/0314","E","porobeton, PP4-0,5, hloubka kotvení 30mm",0.5,4,null,0.3,null,"MW","povrchová","NE",3.0000000000000001E-3]
["TSBD 8_porobeton, PP4-0,5, hloubka kotvení 50mm","TSBD 8","Kew","šroubovací",1.6,62,"08/0314","E","porobeton, PP4-0,5, hloubka kotvení 50mm",0.5,4,null,0.75,null,"MW","povrchová","NE",3.0000000000000001E-3]
[{"$f":"B274&\"_\"&I274","v":"TSBDL 8_beton C12/15"},"TSBDL 8","Kew","šroubovací",1.6,62,"08/0314","A","beton C12/15",null,null,null,1.5,null,"MW","povrchová","NE",2E-3]
["TSBDL 8_beton C16/20 - C50/60","TSBDL 8","Kew","šroubovací",1.6,62,"08/0314","A","beton C16/20 - C50/60",null,null,null,1.5,null,"MW","povrchová","NE",2E-3]
["TSBDL 8_vápenopísk.pl.cihla,podle DIN v 106/EN 771-2","TSBDL 8","Kew","šroubovací",1.6,62,"08/0314","B","vápenopísk.pl.cihla,podle DIN v 106/EN 771-2",1.8,12,null,1.5,null,"MW","povrchová","NE",2E-3]
["TSBDL 8_pl.pálená cihla,podle DIN V 105-100/EN771-1","TSBDL 8","Kew","šroubovací",1.6,62,"08/0314","B","pl.pálená cihla,podle DIN V 105-100/EN771-1",1.7,12,null,1.5,null,"MW","povrchová","NE",2E-3]
["TSBDL 8_pl.tvárnice z lehčbetonu,DIN 18152 ,β>2 N/mm²","TSBDL 8","Kew","šroubovací",1.6,62,"08/0314","B","pl.tvárnice z lehčbetonu,DIN 18152 ,β>2 N/mm²",0.8,2,null,0.75,null,"MW","povrchová","NE",2E-3]
["TSBDL 8_pl.tvárnice z lehčbetonu,DIN 18152 ,β>4 N/mm²","TSBDL 8","Kew","šroubovací",1.6,62,"08/0314","B","pl.tvárnice z lehčbetonu,DIN 18152 ,β>4 N/mm²",0.8,4,null,1.2,null,"MW","povrchová","NE",2E-3]
["TSBDL 8_příč.děr.cihla,Hlz,podle DIN V105-100/EN771-1","TSBDL 8","Kew","šroubovací",1.6,62,"08/0314","C","příč.děr.cihla,Hlz,podle DIN V105-100/EN771-1",1,12,null,0.9,null,"MW","povrchová","NE",2E-3]
["TSBDL 8_vápenopísk.děr..cihla,podle DIN v 106/EN 771-2","TSBDL 8","Kew","šroubovací",1.6,62,"08/0314","C","vápenopísk.děr..cihla,podle DIN v 106/EN 771-2",1.4,12,null,1.2,null,"MW","povrchová","NE",2E-3]
[{"$f":"B282&\"_\"&I282","v":"TSBDL 8_dutin.tvárnice z lehč.betonu,DIN V18151-100/EN771-3"},"TSBDL 8","Kew","šroubovací",1.6,62,"08/0314","C","dutin.tvárnice z lehč.betonu,DIN V18151-100/EN771-3",0.8,2,null,0.9,null,"MW","povrchová","NE",2E-3]
["TSBDL 8_příč.děr.cihla,Hlz 250x380x235mm","TSBDL 8","Kew","šroubovací",1.6,62,"08/0314","C","příč.děr.cihla,Hlz 250x380x235mm",1,6,null,0.5,null,"MW","povrchová","NE",2E-3]
["TSBDL 8_mezer.lehč.beton, β>4 N/mm², hloubka kotvení 30mm","TSBDL 8","Kew","šroubovací",1.6,62,"08/0314","D","mezer.lehč.beton, β>4 N/mm², hloubka kotvení 30mm",1,4,null,0.4,null,"MW","povrchová","NE",2E-3]
["TSBDL 8_mezer.lehč.beton, β>4 N/mm², hloubka kotvení 50mm","TSBDL 8","Kew","šroubovací",1.6,62,"08/0314","D","mezer.lehč.beton, β>4 N/mm², hloubka kotvení 50mm",1,4,null,0.9,null,"MW","povrchová","NE",2E-3]
["TSBDL 8_mezer.lehč.beton, β>6 N/mm², hloubka kotvení 30mm","TSBDL 8","Kew","šroubovací",1.6,62,"08/0314","D","mezer.lehč.beton, β>6 N/mm², hloubka kotvení 30mm",1,6,null,0.5,null,"MW","povrchová","NE",2E-3]
["TSBDL 8_mezer.lehč.beton, β>6 N/mm², hloubka kotvení 50mm","TSBDL 8","Kew","šroubovací",1.6,62,"08/0314","D","mezer.lehč.beton, β>6 N/mm², hloubka kotvení 50mm",1,6,null,1.2,null,"MW","povrchová","NE",2E-3]
["TSBDL 8_porobeton, PP4-0,5, hloubka kotvení 30mm","TSBDL 8","Kew","šroubovací",1.6,62,"08/0314","E","porobeton, PP4-0,5, hloubka kotvení 30mm",0.5,4,null,0.3,null,"MW","povrchová","NE",2E-3]
["TSBDL 8_porobeton, PP4-0,5, hloubka kotvení 50mm","TSBDL 8","Kew","šroubovací",1.6,62,"08/0314","E","porobeton, PP4-0,5, hloubka kotvení 50mm",0.5,4,null,0.75,null,"MW","povrchová","NE",2E-3]
["TSBD 8_beton C12/15","TSBD 8","Kew","šroubovací",1.6,62,"08/0314","A","beton C12/15",null,null,null,1.5,null,"MW","zápustná","NE",2E-3]
["TSBD 8_beton C16/20 - C50/60","TSBD 8","Kew","šroubovací",1.6,62,"08/0314","A","beton C16/20 - C50/60",null,null,null,1.5,null,"MW","zápustná","NE",2E-3]
["TSBD 8_vápenopísk.pl.cihla,podle DIN v 106/EN 771-2","TSBD 8","Kew","šroubovací",1.6,62,"08/0314","B","vápenopísk.pl.cihla,podle DIN v 106/EN 771-2",1.8,12,null,1.5,null,"MW","zápustná","NE",2E-3]
["TSBD 8_pl.pálená cihla,podle DIN V 105-100/EN771-1","TSBD 8","Kew","šroubovací",1.6,62,"08/0314","B","pl.pálená cihla,podle DIN V 105-100/EN771-1",1.7,12,null,1.5,null,"MW","zápustná","NE",2E-3]
["TSBD 8_pl.tvárnice z lehčbetonu,DIN 18152 ,β>2 N/mm²","TSBD 8","Kew","šroubovací",1.6,62,"08/0314","B","pl.tvárnice z lehčbetonu,DIN 18152 ,β>2 N/mm²",0.8,2,null,0.75,null,"MW","zápustná",{"$f":"IF(ISERROR(VLOOKUP(izolant&montáž&B294&talířek,Rpanely,6,)),\"NE\",\"ANO\")","v":"NE"},2E-3]
["TSBD 8_pl.tvárnice z lehčbetonu,DIN 18152 ,β>4 N/mm²","TSBD 8","Kew","šroubovací",1.6,62,"08/0314","B","pl.tvárnice z lehčbetonu,DIN 18152 ,β>4 N/mm²",0.8,4,null,1.2,null,"MW","zápustná","NE",2E-3]
["TSBD 8_příč.děr.cihla,Hlz,podle DIN V105-100/EN771-1","TSBD 8","Kew","šroubovací",1.6,62,"08/0314","C","příč.děr.cihla,Hlz,podle DIN V105-100/EN771-1",1,12,null,0.9,null,"MW","zápustná","NE",2E-3]
["TSBD 8_vápenopísk.děr..cihla,podle DIN v 106/EN 771-2","TSBD 8","Kew","šroubovací",1.6,62,"08/0314","C","vápenopísk.děr..cihla,podle DIN v 106/EN 771-2",1.4,12,null,1.2,null,"MW","zápustná","NE",2E-3]
["TSBD 8_dutin.tvárnice z lehč.betonu,DIN V18151-100/EN771-3","TSBD 8","Kew","šroubovací",1.6,62,"08/0314","C","dutin.tvárnice z lehč.betonu,DIN V18151-100/EN771-3",0.8,2,null,0.9,null,"MW","zápustná","NE",2E-3]
["TSBD 8_příč.děr.cihla,Hlz 250x380x235mm","TSBD 8","Kew","šroubovací",1.6,62,"08/0314","C","příč.děr.cihla,Hlz 250x380x235mm",1,6,null,0.5,null,"MW","zápustná","NE",2E-3]
["TSBD 8_mezer.lehč.beton, β>4 N/mm², hloubka kotvení 30mm","TSBD 8","Kew","šroubovací",1.6,62,"08/0314","D","mezer.lehč.beton, β>4 N/mm², hloubka kotvení 30mm",1,4,null,0.4,null,"MW","zápustná","NE",2E-3]
["TSBD 8_mezer.lehč.beton, β>4 N/mm², hloubka kotvení 50mm","TSBD 8","Kew","šroubovací",1.6,62,"08/0314","D","mezer.lehč.beton, β>4 N/mm², hloubka kotvení 50mm",1,4,null,0.9,null,"MW","zápustná","NE",2E-3]
["TSBD 8_mezer.lehč.beton, β>6 N/mm², hloubka kotvení 30mm","TSBD 8","Kew","šroubovací",1.6,62,"08/0314","D","mezer.lehč.beton, β>6 N/mm², hloubka kotvení 30mm",1,6,null,0.5,null,"MW","zápustná","NE",2E-3]
["TSBD 8_mezer.lehč.beton, β>6 N/mm², hloubka kotvení 50mm","TSBD 8","Kew","šroubovací",1.6,62,"08/0314","D","mezer.lehč.beton, β>6 N/mm², hloubka kotvení 50mm",1,6,null,1.2,null,"MW","zápustná","NE",2E-3]
["TSBD 8_porobeton, PP4-0,5, hloubka kotvení 30mm","TSBD 8","Kew","šroubovací",1.6,62,"08/0314","E","porobeton, PP4-0,5, hloubka kotvení 30mm",0.5,4,null,0.3,null,"MW","zápustná","NE",2E-3]
["TSBD 8_porobeton, PP4-0,5, hloubka kotvení 50mm","TSBD 8","Kew","šroubovací",1.6,62,"08/0314","E","porobeton, PP4-0,5, hloubka kotvení 50mm",0.5,4,null,0.75,null,"MW","zápustná","NE",2E-3]
["TSBDL 8_beton C12/15","TSBDL 8","Kew","šroubovací",1.6,62,"08/0314","A","beton C12/15",null,null,null,1.5,null,"MW","zápustná","NE",1E-3]
["TSBDL 8_beton C16/20 - C50/60","TSBDL 8","Kew","šroubovací",1.6,62,"08/0314","A","beton C16/20 - C50/60",null,null,null,1.5,null,"MW","zápustná","NE",1E-3]
["TSBDL 8_vápenopísk.pl.cihla,podle DIN v 106/EN 771-2","TSBDL 8","Kew","šroubovací",1.6,62,"08/0314","B","vápenopísk.pl.cihla,podle DIN v 106/EN 771-2",1.8,12,null,1.5,null,"MW","zápustná","NE",1E-3]
["TSBDL 8_pl.pálená cihla,podle DIN V 105-100/EN771-1","TSBDL 8","Kew","šroubovací",1.6,62,"08/0314","B","pl.pálená cihla,podle DIN V 105-100/EN771-1",1.7,12,null,1.5,null,"MW","zápustná","NE",1E-3]
["TSBDL 8_pl.tvárnice z lehčbetonu,DIN 18152 ,β>2 N/mm²","TSBDL 8","Kew","šroubovací",1.6,62,"08/0314","B","pl.tvárnice z lehčbetonu,DIN 18152 ,β>2 N/mm²",0.8,2,null,0.75,null,"MW","zápustná","NE",1E-3]
["TSBDL 8_pl.tvárnice z lehčbetonu,DIN 18152 ,β>4 N/mm²","TSBDL 8","Kew","šroubovací",1.6,62,"08/0314","B","pl.tvárnice z lehčbetonu,DIN 18152 ,β>4 N/mm²",0.8,4,null,1.2,null,"MW","zápustná","NE",1E-3]
["TSBDL 8_příč.děr.cihla,Hlz,podle DIN V105-100/EN771-1","TSBDL 8","Kew","šroubovací",1.6,62,"08/0314","C","příč.děr.cihla,Hlz,podle DIN V105-100/EN771-1",1,12,null,0.9,null,"MW","zápustná","NE",1E-3]
["TSBDL 8_vápenopísk.děr..cihla,podle DIN v 106/EN 771-2","TSBDL 8","Kew","šroubovací",1.6,62,"08/0314","C","vápenopísk.děr..cihla,podle DIN v 106/EN 771-2",1.4,12,null,1.2,null,"MW","zápustná","NE",1E-3]
[{"$f":"B314&\"_\"&I314","v":"TSBDL 8_dutin.tvárnice z lehč.betonu,DIN V18151-100/EN771-3"},"TSBDL 8","Kew","šroubovací",1.6,62,"08/0314","C","dutin.tvárnice z lehč.betonu,DIN V18151-100/EN771-3",0.8,2,null,0.9,null,"MW","zápustná","NE",1E-3]
["TSBDL 8_příč.děr.cihla,Hlz 250x380x235mm","TSBDL 8","Kew","šroubovací",1.6,62,"08/0314","C","příč.děr.cihla,Hlz 250x380x235mm",1,6,null,0.5,null,"MW","zápustná","NE",1E-3]
["TSBDL 8_mezer.lehč.beton, β>4 N/mm², hloubka kotvení 30mm","TSBDL 8","Kew","šroubovací",1.6,62,"08/0314","D","mezer.lehč.beton, β>4 N/mm², hloubka kotvení 30mm",1,4,null,0.4,null,"MW","zápustná","NE",1E-3]
["TSBDL 8_mezer.lehč.beton, β>4 N/mm², hloubka kotvení 50mm","TSBDL 8","Kew","šroubovací",1.6,62,"08/0314","D","mezer.lehč.beton, β>4 N/mm², hloubka kotvení 50mm",1,4,null,0.9,null,"MW","zápustná","NE",1E-3]
["TSBDL 8_mezer.lehč.beton, β>6 N/mm², hloubka kotvení 30mm","TSBDL 8","Kew","šroubovací",1.6,62,"08/0314","D","mezer.lehč.beton, β>6 N/mm², hloubka kotvení 30mm",1,6,null,0.5,null,"MW","zápustná","NE",1E-3]
["TSBDL 8_mezer.lehč.beton, β>6 N/mm², hloubka kotvení 50mm","TSBDL 8","Kew","šroubovací",1.6,62,"08/0314","D","mezer.lehč.beton, β>6 N/mm², hloubka kotvení 50mm",1,6,null,1.2,null,"MW","zápustná","NE",1E-3]
["TSBDL 8_porobeton, PP4-0,5, hloubka kotvení 30mm","TSBDL 8","Kew","šroubovací",1.6,62,"08/0314","E","porobeton, PP4-0,5, hloubka kotvení 30mm",0.5,4,null,0.3,null,"MW","zápustná","NE",1E-3]
["TSBDL 8_porobeton, PP4-0,5, hloubka kotvení 50mm","TSBDL 8","Kew","šroubovací",1.6,62,"08/0314","E","porobeton, PP4-0,5, hloubka kotvení 50mm",0.5,4,null,0.75,null,"MW","zápustná","NE",1E-3]

{"sheet":"rozmístěníhmoždinek","index":8,"n_rows":106,"n_cols":19,"rows_kept":106,"cut":false,"hidden":true,"merged":[]}
[]
[null,null,null,null,null,null,null,null,null,null,null,"Rozmístění pro desky 600x1000"]
[null,6,null,null,null,null,null,null,null,null,null,"ks/m²","–",6,8,10,12,14,16]
[null,null,null,null,null,null,null,null,null,null,null,"obrázek","–",{"$f":"CEILING(N3*600/500,2)","v":8},10,12,16,18,20]
[null,4]
[null,"ve"]
[null,"spárách"]
[]
[]
[null,8]
[]
[null,4]
[null,"ve"]
[null,"spárách"]
[]
[]
[null,10]
[]
[null,4]
[null,"ve"]
[null,"spárách"]
[]
[]
[null,12,null,null,null,null,null,null,null,12]
[]
[null,4,null,null,null,null,null,null,null,6]
[null,"ve",null,null,null,null,null,null,null,"ve"]
[null,"spárách",null,null,null,null,null,null,null,"spárách"]
[]
[]
[null,14,null,null,null,null,null,null,null,14]
[]
[null,4,null,null,null,null,null,null,null,6]
[null,"ve",null,null,null,null,null,null,null,"ve"]
[null,"spárách",null,null,null,null,null,null,null,"spárách"]
[]
[]
[null,16,null,null,null,null,null,null,null,16]
[]
[null,6,null,null,null,null,null,null,null,8]
[null,"ve",null,null,null,null,null,null,null,"ve"]
[null,"spárách",null,null,null,null,null,null,null,"spárách"]
[]
[]
[null,18]
[]
[null,8]
[null,"ve"]
[null,"spárách"]
[]
[]
[null,20]
[]
[null,8]
[null,"ve"]
[null,"spárách"]
[]
[]
[null,4]
[]
[null,0]
[null,"ve"]
[null,"spárách"]
[]
[null,null,null,null,null,null,"(náhradní alternativa)"]
[null,6]
[]
[null,0]
[null,"ve"]
[null,"spárách"]
[null,null,"Poznámka: Odstupy od kraje desky min. 100 mm."]
[]
[null,8]
[]
[null,0]
[null,"ve"]
[null,"spárách"]
[null,null,"Poznámka: Odstupy od kraje desky min. 100 mm."]
[]
[null,10]
[]
[null,0]
[null,"ve"]
[null,"spárách"]
[null,null,"Poznámka: Odstupy od kraje desky min. 100 mm."]
[]
[null,12]
[]
[null,0]
[null,"ve"]
[null,"spárách"]
[null,null,"Poznámka: Odstupy od kraje desky min. 100 mm."]
[]
[null,14]
[]
[null,0]
[null,"ve"]
[null,"spárách"]
[null,null,"Poznámka: ecotwist nelze kotvit se 7 hmoždinkami na desku."]
[]
[null,16]
[]
[null,0]
[null,"ve"]
[null,"spárách"]
[null,null,"Poznámka: ecotwist nelze kotvit s 8 hmoždinkami na desku."]

{"sheet":"počtyhmoždinek","index":9,"n_rows":641,"n_cols":10,"rows_kept":641,"cut":false,"hidden":true,"merged":[]}
["index","index objektu","větrová oblast","kategorie terénu","výška objektu","třída únosnosti","hmoždinek na m²","hmoždinek na 1,2 m²",null,{"$f":"IF(RIGHT(myHmoždinka,8)=\"ecotwist\",TRUE,FALSE)","v":false}]
[{"$f":"B2&\"/\"&F2","v":"I;I;do 10/0,10"},{"$f":"C2&\";\"&D2&\";\"&E2","v":"I;I;do 10"},"I","I","do 10","0,10","–","–"]
["I;I;do 15/0,10","I;I;do 15","I",{"$f":"D2","v":"I"},"do 15",{"$f":"F2","v":"0,10"},"–","–"]
["I;I;do 25/0,10","I;I;do 25","I",{"$f":"D3","v":"I"},"do 25","0,10","–","–"]
["I;I;do 38/0,10","I;I;do 38","I",{"$f":"D4","v":"I"},"do 38","0,10","–","–"]
["I;II;do 10/0,10","I;II;do 10","I","II","do 10","0,10",{"$f":"IF(ecotwist,\"–\",16)","v":16},"–"]
["I;II;do 15/0,10","I;II;do 15","I",{"$f":"D6","v":"II"},"do 15","0,10","–","–"]
["I;II;do 25/0,10","I;II;do 25","I",{"$f":"D7","v":"II"},"do 25","0,10","–","–"]
["I;II;do 38/0,10","I;II;do 38","I",{"$f":"D8","v":"II"},"do 38","0,10","–","–"]
["I;III;do 10/0,10","I;III;do 10","I","III","do 10","0,10",12,{"$f":"IF(ecotwist,\"–\",14)","v":14}]
["I;III;do 15/0,10","I;III;do 15","I",{"$f":"D10","v":"III"},"do 15","0,10",{"$f":"IF(ecotwist,\"–\",14)","v":14},{"$f":"IF(ecotwist,\"–\",16)","v":16}]
["I;III;do 25/0,10","I;III;do 25","I",{"$f":"D11","v":"III"},"do 25","0,10",{"$f":"IF(ecotwist,\"–\",16)","v":16},"–"]
["I;III;do 38/0,10","I;III;do 38","I",{"$f":"D12","v":"III"},"do 38","0,10","–","–"]
["I;IV;do 10/0,10","I;IV;do 10","I","IV","do 10","0,10",8,10]
["I;IV;do 15/0,10","I;IV;do 15","I",{"$f":"D14","v":"IV"},"do 15","0,10",10,12]
["I;IV;do 25/0,10","I;IV;do 25","I",{"$f":"D15","v":"IV"},"do 25","0,10",{"$f":"IF(ecotwist,\"–\",14)","v":14},{"$f":"IF(ecotwist,\"–\",16)","v":16}]
["I;IV;do 38/0,10","I;IV;do 38","I",{"$f":"D16","v":"IV"},"do 38","0,10",{"$f":"IF(ecotwist,\"–\",14)","v":14},"–"]
["I;I;do 10/0,12","I;I;do 10","I","I","do 10","0,12","–","–"]
["I;I;do 15/0,12","I;I;do 15","I",{"$f":"D18","v":"I"},"do 15",{"$f":"F18","v":"0,12"},"–","–"]
["I;I;do 25/0,12","I;I;do 25","I",{"$f":"D19","v":"I"},"do 25","0,12","–","–"]
["I;I;do 38/0,12","I;I;do 38","I",{"$f":"D20","v":"I"},"do 38","0,12","–","–"]
["I;II;do 10/0,12","I;II;do 10","I","II","do 10","0,12",{"$f":"IF(ecotwist,\"–\",14)","v":14},{"$f":"IF(ecotwist,\"–\",16)","v":16}]
["I;II;do 15/0,12","I;II;do 15","I",{"$f":"D22","v":"II"},"do 15","0,12",{"$f":"IF(ecotwist,\"–\",16)","v":16},"–"]
["I;II;do 25/0,12","I;II;do 25","I",{"$f":"D23","v":"II"},"do 25","0,12","–","–"]
["I;II;do 38/0,12","I;II;do 38","I",{"$f":"D24","v":"II"},"do 38","0,12","–","–"]
["I;III;do 10/0,12","I;III;do 10","I","III","do 10","0,12",10,12]
["I;III;do 15/0,12","I;III;do 15","I",{"$f":"D26","v":"III"},"do 15","0,12",12,{"$f":"IF(ecotwist,\"–\",14)","v":14}]
["I;III;do 25/0,12","I;III;do 25","I",{"$f":"D27","v":"III"},"do 25","0,12",{"$f":"IF(ecotwist,\"–\",14)","v":14},{"$f":"IF(ecotwist,\"–\",16)","v":16}]
["I;III;do 38/0,12","I;III;do 38","I",{"$f":"D28","v":"III"},"do 38","0,12",{"$f":"IF(ecotwist,\"–\",16)","v":16},"–"]
["I;IV;do 10/0,12","I;IV;do 10","I","IV","do 10","0,12",8,8]
["I;IV;do 15/0,12","I;IV;do 15","I",{"$f":"D30","v":"IV"},"do 15","0,12",8,10]
["I;IV;do 25/0,12","I;IV;do 25","I",{"$f":"D31","v":"IV"},"do 25","0,12",12,{"$f":"IF(ecotwist,\"–\",14)","v":14}]
["I;IV;do 38/0,12","I;IV;do 38","I",{"$f":"D32","v":"IV"},"do 38","0,12",12,{"$f":"IF(ecotwist,\"–\",14)","v":14}]
["I;I;do 10/0,15","I;I;do 10","I","I","do 10","0,15",{"$f":"IF(ecotwist,\"–\",14)","v":14},{"$f":"IF(ecotwist,\"–\",16)","v":16}]
["I;I;do 15/0,15","I;I;do 15","I",{"$f":"D34","v":"I"},"do 15",{"$f":"F34","v":"0,15"},{"$f":"IF(ecotwist,\"–\",14)","v":14},"–"]
["I;I;do 25/0,15","I;I;do 25","I",{"$f":"D35","v":"I"},"do 25","0,15",{"$f":"IF(ecotwist,\"–\",16)","v":16},"–"]
["I;I;do 38/0,15","I;I;do 38","I",{"$f":"D36","v":"I"},"do 38","0,15",{"$f":"IF(ecotwist,\"–\",16)","v":16},"–"]
["I;II;do 10/0,15","I;II;do 10","I","II","do 10","0,15",12,{"$f":"IF(ecotwist,\"–\",14)","v":14}]
["I;II;do 15/0,15","I;II;do 15","I",{"$f":"D38","v":"II"},"do 15","0,15",12,{"$f":"IF(ecotwist,\"–\",14)","v":14}]
["I;II;do 25/0,15","I;II;do 25","I",{"$f":"D39","v":"II"},"do 25","0,15",{"$f":"IF(ecotwist,\"–\",14)","v":14},{"$f":"IF(ecotwist,\"–\",16)","v":16}]
["I;II;do 38/0,15","I;II;do 38","I",{"$f":"D40","v":"II"},"do 38","0,15",{"$f":"IF(ecotwist,\"–\",16)","v":16},"–"]
["I;III;do 10/0,15","I;III;do 10","I","III","do 10","0,15",8,10]
["I;III;do 15/0,15","I;III;do 15","I",{"$f":"D42","v":"III"},"do 15","0,15",10,12]
["I;III;do 25/0,15","I;III;do 25","I",{"$f":"D43","v":"III"},"do 25","0,15",12,{"$f":"IF(ecotwist,\"–\",14)","v":14}]
["I;III;do 38/0,15","I;III;do 38","I",{"$f":"D44","v":"III"},"do 38","0,15",12,{"$f":"IF(ecotwist,\"–\",16)","v":16}]
["I;IV;do 10/0,15","I;IV;do 10","I","IV","do 10","0,15",6,8]
["I;IV;do 15/0,15","I;IV;do 15","I",{"$f":"D46","v":"IV"},"do 15","0,15",8,8]
["I;IV;do 25/0,15","I;IV;do 25","I",{"$f":"D47","v":"IV"},"do 25","0,15",10,10]
["I;IV;do 38/0,15","I;IV;do 38","I",{"$f":"D48","v":"IV"},"do 38","0,15",10,12]
["I;I;do 10/0,20","I;I;do 10","I","I","do 10","0,20",10,12]
["I;I;do 15/0,20","I;I;do 15","I",{"$f":"D50","v":"I"},"do 15",{"$f":"F50","v":"0,20"},12,{"$f":"IF(ecotwist,\"–\",14)","v":14}]
["I;I;do 25/0,20","I;I;do 25","I",{"$f":"D51","v":"I"},"do 25","0,20",12,{"$f":"IF(ecotwist,\"–\",14)","v":14}]
["I;I;do 38/0,20","I;I;do 38","I",{"$f":"D52","v":"I"},"do 38","0,20",12,{"$f":"IF(ecotwist,\"–\",16)","v":16}]
["I;II;do 10/0,20","I;II;do 10","I","II","do 10","0,20",8,10]
["I;II;do 15/0,20","I;II;do 15","I",{"$f":"D54","v":"II"},"do 15","0,20",10,12]
["I;II;do 25/0,20","I;II;do 25","I",{"$f":"D55","v":"II"},"do 25","0,20",10,12]
["I;II;do 38/0,20","I;II;do 38","I",{"$f":"D56","v":"II"},"do 38","0,20",12,{"$f":"IF(ecotwist,\"–\",14)","v":14}]
["I;III;do 10/0,20","I;III;do 10","I","III","do 10","0,20",6,8]
["I;III;do 15/0,20","I;III;do 15","I",{"$f":"D58","v":"III"},"do 15","0,20",8,8]
["I;III;do 25/0,20","I;III;do 25","I",{"$f":"D59","v":"III"},"do 25","0,20",8,10]
["I;III;do 38/0,20","I;III;do 38","I",{"$f":"D60","v":"III"},"do 38","0,20",10,12]
["I;IV;do 10/0,20","I;IV;do 10","I","IV","do 10","0,20",6,6]
["I;IV;do 15/0,20","I;IV;do 15","I",{"$f":"D62","v":"IV"},"do 15","0,20",6,6]
["I;IV;do 25/0,20","I;IV;do 25","I",{"$f":"D63","v":"IV"},"do 25","0,20",8,8]
["I;IV;do 38/0,20","I;IV;do 38","I",{"$f":"D64","v":"IV"},"do 38","0,20",8,10]
[{"$f":"B66&\"/\"&F66","v":"I;I;do 10/0,25"},{"$f":"C66&\";\"&D66&\";\"&E66","v":"I;I;do 10"},"I","I","do 10","0,25",8,10]
["I;I;do 15/0,25","I;I;do 15","I",{"$f":"D66","v":"I"},"do 15",{"$f":"F66","v":"0,25"},10,10]
["I;I;do 25/0,25","I;I;do 25","I",{"$f":"D67","v":"I"},"do 25","0,25",10,12]
["I;I;do 38/0,25","I;I;do 38","I",{"$f":"D68","v":"I"},"do 38","0,25",10,12]
["I;II;do 10/0,25","I;II;do 10","I","II","do 10","0,25",8,8]
["I;II;do 15/0,25","I;II;do 15","I",{"$f":"D70","v":"II"},"do 15","0,25",8,10]
["I;II;do 25/0,25","I;II;do 25","I",{"$f":"D71","v":"II"},"do 25","0,25",8,10]
["I;II;do 38/0,25","I;II;do 38","I",{"$f":"D72","v":"II"},"do 38","0,25",10,12]
["I;III;do 10/0,25","I;III;do 10","I","III","do 10","0,25",6,6]
["I;III;do 15/0,25","I;III;do 15","I",{"$f":"D74","v":"III"},"do 15","0,25",6,8]
["I;III;do 25/0,25","I;III;do 25","I",{"$f":"D75","v":"III"},"do 25","0,25",8,8]
["I;III;do 38/0,25","I;III;do 38","I",{"$f":"D76","v":"III"},"do 38","0,25",8,10]
["I;IV;do 10/0,25","I;IV;do 10","I","IV","do 10","0,25",6,6]
["I;IV;do 15/0,25","I;IV;do 15","I",{"$f":"D78","v":"IV"},"do 15","0,25",6,6]
["I;IV;do 25/0,25","I;IV;do 25","I",{"$f":"D79","v":"IV"},"do 25","0,25",6,6]
["I;IV;do 38/0,25","I;IV;do 38","I",{"$f":"D80","v":"IV"},"do 38","0,25",6,8]
["I;I;do 10/0,30","I;I;do 10","I","I","do 10","0,30",8,8]
["I;I;do 15/0,30","I;I;do 15","I",{"$f":"D82","v":"I"},"do 15",{"$f":"F82","v":"0,30"},8,10]
["I;I;do 25/0,30","I;I;do 25","I",{"$f":"D83","v":"I"},"do 25","0,30",8,10]
["I;I;do 38/0,30","I;I;do 38","I",{"$f":"D84","v":"I"},"do 38","0,30",8,10]
["I;II;do 10/0,30","I;II;do 10","I","II","do 10","0,30",6,8]
["I;II;do 15/0,30","I;II;do 15","I",{"$f":"D86","v":"II"},"do 15","0,30",6,8]
["I;II;do 25/0,30","I;II;do 25","I",{"$f":"D87","v":"II"},"do 25","0,30",8,8]
["I;II;do 38/0,30","I;II;do 38","I",{"$f":"D88","v":"II"},"do 38","0,30",8,10]
["I;III;do 10/0,30","I;III;do 10","I","III","do 10","0,30",6,6]
["I;III;do 15/0,30","I;III;do 15","I",{"$f":"D90","v":"III"},"do 15","0,30",6,6]
["I;III;do 25/0,30","I;III;do 25","I",{"$f":"D91","v":"III"},"do 25","0,30",6,8]
["I;III;do 38/0,30","I;III;do 38","I",{"$f":"D92","v":"III"},"do 38","0,30",6,8]
["I;IV;do 10/0,30","I;IV;do 10","I","IV","do 10","0,30",6,6]
["I;IV;do 15/0,30","I;IV;do 15","I",{"$f":"D94","v":"IV"},"do 15","0,30",6,6]
["I;IV;do 25/0,30","I;IV;do 25","I",{"$f":"D95","v":"IV"},"do 25","0,30",6,6]
["I;IV;do 38/0,30","I;IV;do 38","I",{"$f":"D96","v":"IV"},"do 38","0,30",6,6]
["I;I;do 10/0,40","I;I;do 10","I","I","do 10","0,40",6,6]
["I;I;do 15/0,40","I;I;do 15","I",{"$f":"D98","v":"I"},"do 15",{"$f":"F98","v":"0,40"},6,8]
["I;I;do 25/0,40","I;I;do 25","I",{"$f":"D99","v":"I"},"do 25","0,40",6,8]
["I;I;do 38/0,40","I;I;do 38","I",{"$f":"D100","v":"I"},"do 38","0,40",6,8]
["I;II;do 10/0,40","I;II;do 10","I","II","do 10","0,40",6,6]
["I;II;do 15/0,40","I;II;do 15","I",{"$f":"D102","v":"II"},"do 15","0,40",6,6]
["I;II;do 25/0,40","I;II;do 25","I",{"$f":"D103","v":"II"},"do 25","0,40",6,6]
["I;II;do 38/0,40","I;II;do 38","I",{"$f":"D104","v":"II"},"do 38","0,40",6,8]
["I;III;do 10/0,40","I;III;do 10","I","III","do 10","0,40",6,6]
["I;III;do 15/0,40","I;III;do 15","I",{"$f":"D106","v":"III"},"do 15","0,40",6,6]
["I;III;do 25/0,40","I;III;do 25","I",{"$f":"D107","v":"III"},"do 25","0,40",6,6]
["I;III;do 38/0,40","I;III;do 38","I",{"$f":"D108","v":"III"},"do 38","0,40",6,6]
["I;IV;do 10/0,40","I;IV;do 10","I","IV","do 10","0,40",6,6]
["I;IV;do 15/0,40","I;IV;do 15","I",{"$f":"D110","v":"IV"},"do 15","0,40",6,6]
["I;IV;do 25/0,40","I;IV;do 25","I",{"$f":"D111","v":"IV"},"do 25","0,40",6,6]
["I;IV;do 38/0,40","I;IV;do 38","I",{"$f":"D112","v":"IV"},"do 38","0,40",6,6]
["I;I;do 10/0,50","I;I;do 10","I","I","do 10","0,50",6,6]
["I;I;do 15/0,50","I;I;do 15","I",{"$f":"D114","v":"I"},"do 15",{"$f":"F114","v":"0,50"},6,6]
["I;I;do 25/0,50","I;I;do 25","I",{"$f":"D115","v":"I"},"do 25","0,50",6,6]
["I;I;do 38/0,50","I;I;do 38","I",{"$f":"D116","v":"I"},"do 38","0,50",6,6]
["I;II;do 10/0,50","I;II;do 10","I","II","do 10","0,50",6,6]
["I;II;do 15/0,50","I;II;do 15","I",{"$f":"D118","v":"II"},"do 15","0,50",6,6]
["I;II;do 25/0,50","I;II;do 25","I",{"$f":"D119","v":"II"},"do 25","0,50",6,6]
["I;II;do 38/0,50","I;II;do 38","I",{"$f":"D120","v":"II"},"do 38","0,50",6,6]
["I;III;do 10/0,50","I;III;do 10","I","III","do 10","0,50",6,6]
["I;III;do 15/0,50","I;III;do 15","I",{"$f":"D122","v":"III"},"do 15","0,50",6,6]
["I;III;do 25/0,50","I;III;do 25","I",{"$f":"D123","v":"III"},"do 25","0,50",6,6]
["I;III;do 38/0,50","I;III;do 38","I",{"$f":"D124","v":"III"},"do 38","0,50",6,6]
["I;IV;do 10/0,50","I;IV;do 10","I","IV","do 10","0,50",6,6]
["I;IV;do 15/0,50","I;IV;do 15","I",{"$f":"D126","v":"IV"},"do 15","0,50",6,6]
["I;IV;do 25/0,50","I;IV;do 25","I",{"$f":"D127","v":"IV"},"do 25","0,50",6,6]
["I;IV;do 38/0,50","I;IV;do 38","I",{"$f":"D128","v":"IV"},"do 38","0,50",6,6]
[{"$f":"B130&\"/\"&F130","v":"II;I;do 10/0,10"},{"$f":"C130&\";\"&D130&\";\"&E130","v":"II;I;do 10"},"II","I","do 10","0,10","–","–"]
["II;I;do 15/0,10","II;I;do 15","II",{"$f":"D130","v":"I"},"do 15",{"$f":"F130","v":"0,10"},"–","–"]
["II;I;do 25/0,10","II;I;do 25","II",{"$f":"D131","v":"I"},"do 25","0,10","–","–"]
["II;I;do 38/0,10","II;I;do 38","II",{"$f":"D132","v":"I"},"do 38","0,10","–","–"]
["II;II;do 10/0,10","II;II;do 10","II","II","do 10","0,10","–","–"]
["II;II;do 15/0,10","II;II;do 15","II",{"$f":"D134","v":"II"},"do 15","0,10","–","–"]
["II;II;do 25/0,10","II;II;do 25","II",{"$f":"D135","v":"II"},"do 25","0,10","–","–"]
["II;II;do 38/0,10","II;II;do 38","II",{"$f":"D136","v":"II"},"do 38","0,10","–","–"]
["II;III;do 10/0,10","II;III;do 10","II","III","do 10","0,10",{"$f":"IF(ecotwist,\"–\",16)","v":16},"–"]
["II;III;do 15/0,10","II;III;do 15","II",{"$f":"D138","v":"III"},"do 15","0,10","–","–"]
["II;III;do 25/0,10","II;III;do 25","II",{"$f":"D139","v":"III"},"do 25","0,10","–","–"]
["II;III;do 38/0,10","II;III;do 38","II",{"$f":"D140","v":"III"},"do 38","0,10","–","–"]
["II;IV;do 10/0,10","II;IV;do 10","II","IV","do 10","0,10",10,12]
["II;IV;do 15/0,10","II;IV;do 15","II",{"$f":"D142","v":"IV"},"do 15","0,10",12,{"$f":"IF(ecotwist,\"–\",16)","v":16}]
["II;IV;do 25/0,10","II;IV;do 25","II",{"$f":"D143","v":"IV"},"do 25","0,10",{"$f":"IF(ecotwist,\"–\",16)","v":16},"–"]
["II;IV;do 38/0,10","II;IV;do 38","II",{"$f":"D144","v":"IV"},"do 38","0,10","–","–"]
["II;I;do 10/0,12","II;I;do 10","II","I","do 10","0,12","–","–"]
["II;I;do 15/0,12","II;I;do 15","II",{"$f":"D146","v":"I"},"do 15",{"$f":"F146","v":"0,12"},"–","–"]
["II;I;do 25/0,12","II;I;do 25","II",{"$f":"D147","v":"I"},"do 25","0,12","–","–"]
["II;I;do 38/0,12","II;I;do 38","II",{"$f":"D148","v":"I"},"do 38","0,12","–","–"]
["II;II;do 10/0,12","II;II;do 10","II","II","do 10","0,12","–","–"]
["II;II;do 15/0,12","II;II;do 15","II",{"$f":"D150","v":"II"},"do 15","0,12","–","–"]
["II;II;do 25/0,12","II;II;do 25","II",{"$f":"D151","v":"II"},"do 25","0,12","–","–"]
["II;II;do 38/0,12","II;II;do 38","II",{"$f":"D152","v":"II"},"do 38","0,12","–","–"]
["II;III;do 10/0,12","II;III;do 10","II","III","do 10","0,12",12,{"$f":"IF(ecotwist,\"–\",16)","v":16}]
["II;III;do 15/0,12","II;III;do 15","II",{"$f":"D154","v":"III"},"do 15","0,12",{"$f":"IF(ecotwist,\"–\",14)","v":14},"–"]
["II;III;do 25/0,12","II;III;do 25","II",{"$f":"D155","v":"III"},"do 25","0,12","–","–"]
["II;III;do 38/0,12","II;III;do 38","II",{"$f":"D156","v":"III"},"do 38","0,12","–","–"]
["II;IV;do 10/0,12","II;IV;do 10","II","IV","do 10","0,12",10,10]
["II;IV;do 15/0,12","II;IV;do 15","II",{"$f":"D158","v":"IV"},"do 15","0,12",10,12]
["II;IV;do 25/0,12","II;IV;do 25","II",{"$f":"D159","v":"IV"},"do 25","0,12",{"$f":"IF(ecotwist,\"–\",14)","v":14},{"$f":"IF(ecotwist,\"–\",16)","v":16}]
["II;IV;do 38/0,12","II;IV;do 38","II",{"$f":"D160","v":"IV"},"do 38","0,12",{"$f":"IF(ecotwist,\"–\",16)","v":16},"–"]
["II;I;do 10/0,15","II;I;do 10","II","I","do 10","0,15",{"$f":"IF(ecotwist,\"–\",16)","v":16},"–"]
["II;I;do 15/0,15","II;I;do 15","II",{"$f":"D162","v":"I"},"do 15",{"$f":"F162","v":"0,15"},"–","–"]
["II;I;do 25/0,15","II;I;do 25","II",{"$f":"D163","v":"I"},"do 25","0,15","–","–"]
["II;I;do 38/0,15","II;I;do 38","II",{"$f":"D164","v":"I"},"do 38","0,15","–","–"]
["II;II;do 10/0,15","II;II;do 10","II","II","do 10","0,15",{"$f":"IF(ecotwist,\"–\",14)","v":14},{"$f":"IF(ecotwist,\"–\",16)","v":16}]
["II;II;do 15/0,15","II;II;do 15","II",{"$f":"D166","v":"II"},"do 15","0,15",{"$f":"IF(ecotwist,\"–\",16)","v":16},"–"]
["II;II;do 25/0,15","II;II;do 25","II",{"$f":"D167","v":"II"},"do 25","0,15","–","–"]
["II;II;do 38/0,15","II;II;do 38","II",{"$f":"D168","v":"II"},"do 38","0,15","–","–"]
["II;III;do 10/0,15","II;III;do 10","II","III","do 10","0,15",10,12]
["II;III;do 15/0,15","II;III;do 15","II",{"$f":"D170","v":"III"},"do 15","0,15",12,{"$f":"IF(ecotwist,\"–\",14)","v":14}]
["II;III;do 25/0,15","II;III;do 25","II",{"$f":"D171","v":"III"},"do 25","0,15",{"$f":"IF(ecotwist,\"–\",14)","v":14},{"$f":"IF(ecotwist,\"–\",16)","v":16}]
["II;III;do 38/0,15","II;III;do 38","II",{"$f":"D172","v":"III"},"do 38","0,15",{"$f":"IF(ecotwist,\"–\",16)","v":16},"–"]
["II;IV;do 10/0,15","II;IV;do 10","II","IV","do 10","0,15",8,8]
["II;IV;do 15/0,15","II;IV;do 15","II",{"$f":"D174","v":"IV"},"do 15","0,15",8,10]
["II;IV;do 25/0,15","II;IV;do 25","II",{"$f":"D175","v":"IV"},"do 25","0,15",12,12]
["II;IV;do 38/0,15","II;IV;do 38","II",{"$f":"D176","v":"IV"},"do 38","0,15",12,{"$f":"IF(ecotwist,\"–\",14)","v":14}]
["II;I;do 10/0,20","II;I;do 10","II","I","do 10","0,20",12,{"$f":"IF(ecotwist,\"–\",14)","v":14}]
["II;I;do 15/0,20","II;I;do 15","II",{"$f":"D178","v":"I"},"do 15",{"$f":"F178","v":"0,20"},{"$f":"IF(ecotwist,\"–\",14)","v":14},{"$f":"IF(ecotwist,\"–\",16)","v":16}]
["II;I;do 25/0,20","II;I;do 25","II",{"$f":"D179","v":"I"},"do 25","0,20",{"$f":"IF(ecotwist,\"–\",14)","v":14},"–"]
["II;I;do 38/0,20","II;I;do 38","II",{"$f":"D180","v":"I"},"do 38","0,20",{"$f":"IF(ecotwist,\"–\",16)","v":16},"–"]
["II;II;do 10/0,20","II;II;do 10","II","II","do 10","0,20",10,12]
["II;II;do 15/0,20","II;II;do 15","II",{"$f":"D182","v":"II"},"do 15","0,20",12,{"$f":"IF(ecotwist,\"–\",14)","v":14}]
["II;II;do 25/0,20","II;II;do 25","II",{"$f":"D183","v":"II"},"do 25","0,20",{"$f":"IF(ecotwist,\"–\",14)","v":14},{"$f":"IF(ecotwist,\"–\",16)","v":16}]
["II;II;do 38/0,20","II;II;do 38","II",{"$f":"D184","v":"II"},"do 38","0,20",{"$f":"IF(ecotwist,\"–\",14)","v":14},{"$f":"IF(ecotwist,\"–\",16)","v":16}]
["II;III;do 10/0,20","II;III;do 10","II","III","do 10","0,20",8,10]
["II;III;do 15/0,20","II;III;do 15","II",{"$f":"D186","v":"III"},"do 15","0,20",10,10]
["II;III;do 25/0,20","II;III;do 25","II",{"$f":"D187","v":"III"},"do 25","0,20",10,12]
["II;III;do 38/0,20","II;III;do 38","II",{"$f":"D188","v":"III"},"do 38","0,20",12,{"$f":"IF(ecotwist,\"–\",14)","v":14}]
["II;IV;do 10/0,20","II;IV;do 10","II","IV","do 10","0,20",6,6]
["II;IV;do 15/0,20","II;IV;do 15","II",{"$f":"D190","v":"IV"},"do 15","0,20",6,8]
["II;IV;do 25/0,20","II;IV;do 25","II",{"$f":"D191","v":"IV"},"do 25","0,20",8,10]
["II;IV;do 38/0,20","II;IV;do 38","II",{"$f":"D192","v":"IV"},"do 38","0,20",10,12]
[{"$f":"B194&\"/\"&F194","v":"II;I;do 10/0,25"},{"$f":"C194&\";\"&D194&\";\"&E194","v":"II;I;do 10"},"II","I","do 10","0,25",10,12]
["II;I;do 15/0,25","II;I;do 15","II",{"$f":"D194","v":"I"},"do 15",{"$f":"F194","v":"0,25"},10,12]
["II;I;do 25/0,25","II;I;do 25","II",{"$f":"D195","v":"I"},"do 25","0,25",12,{"$f":"IF(ecotwist,\"–\",14)","v":14}]
["II;I;do 38/0,25","II;I;do 38","II",{"$f":"D196","v":"I"},"do 38","0,25",12,{"$f":"IF(ecotwist,\"–\",16)","v":16}]
["II;II;do 10/0,25","II;II;do 10","II","II","do 10","0,25",8,10]
["II;II;do 15/0,25","II;II;do 15","II",{"$f":"D198","v":"II"},"do 15","0,25",10,12]
["II;II;do 25/0,25","II;II;do 25","II",{"$f":"D199","v":"II"},"do 25","0,25",10,12]
["II;II;do 38/0,25","II;II;do 38","II",{"$f":"D200","v":"II"},"do 38","0,25",12,{"$f":"IF(ecotwist,\"–\",14)","v":14}]
["II;III;do 10/0,25","II;III;do 10","II","III","do 10","0,25",6,8]
["II;III;do 15/0,25","II;III;do 15","II",{"$f":"D202","v":"III"},"do 15","0,25",8,8]
["II;III;do 25/0,25","II;III;do 25","II",{"$f":"D203","v":"III"},"do 25","0,25",8,10]
["II;III;do 38/0,25","II;III;do 38","II",{"$f":"D204","v":"III"},"do 38","0,25",10,12]
["II;IV;do 10/0,25","II;IV;do 10","II","IV","do 10","0,25",6,6]
["II;IV;do 15/0,25","II;IV;do 15","II",{"$f":"D206","v":"IV"},"do 15","0,25",6,6]
["II;IV;do 25/0,25","II;IV;do 25","II",{"$f":"D207","v":"IV"},"do 25","0,25",8,8]
["II;IV;do 38/0,25","II;IV;do 38","II",{"$f":"D208","v":"IV"},"do 38","0,25",8,10]
["II;I;do 10/0,30","II;I;do 10","II","I","do 10","0,30",8,10]
["II;I;do 15/0,30","II;I;do 15","II",{"$f":"D210","v":"I"},"do 15",{"$f":"F210","v":"0,30"},10,10]
["II;I;do 25/0,30","II;I;do 25","II",{"$f":"D211","v":"I"},"do 25","0,30",10,12]
["II;I;do 38/0,30","II;I;do 38","II",{"$f":"D212","v":"I"},"do 38","0,30",10,12]
["II;II;do 10/0,30","II;II;do 10","II","II","do 10","0,30",8,8]
["II;II;do 15/0,30","II;II;do 15","II",{"$f":"D214","v":"II"},"do 15","0,30",8,10]
["II;II;do 25/0,30","II;II;do 25","II",{"$f":"D215","v":"II"},"do 25","0,30",10,10]
["II;II;do 38/0,30","II;II;do 38","II",{"$f":"D216","v":"II"},"do 38","0,30",10,12]
["II;III;do 10/0,30","II;III;do 10","II","III","do 10","0,30",6,6]
["II;III;do 15/0,30","II;III;do 15","II",{"$f":"D218","v":"III"},"do 15","0,30",6,8]
["II;III;do 25/0,30","II;III;do 25","II",{"$f":"D219","v":"III"},"do 25","0,30",8,8]
["II;III;do 38/0,30","II;III;do 38","II",{"$f":"D220","v":"III"},"do 38","0,30",8,10]
["II;IV;do 10/0,30","II;IV;do 10","II","IV","do 10","0,30",6,6]
["II;IV;do 15/0,30","II;IV;do 15","II",{"$f":"D222","v":"IV"},"do 15","0,30",6,6]
["II;IV;do 25/0,30","II;IV;do 25","II",{"$f":"D223","v":"IV"},"do 25","0,30",6,6]
["II;IV;do 38/0,30","II;IV;do 38","II",{"$f":"D224","v":"IV"},"do 38","0,30",6,8]
["II;I;do 10/0,40","II;I;do 10","II","I","do 10","0,40",6,8]
["II;I;do 15/0,40","II;I;do 15","II",{"$f":"D226","v":"I"},"do 15",{"$f":"F226","v":"0,40"},8,8]
["II;I;do 25/0,40","II;I;do 25","II",{"$f":"D227","v":"I"},"do 25","0,40",8,10]
["II;I;do 38/0,40","II;I;do 38","II",{"$f":"D228","v":"I"},"do 38","0,40",8,10]
["II;II;do 10/0,40","II;II;do 10","II","II","do 10","0,40",6,6]
["II;II;do 15/0,40","II;II;do 15","II",{"$f":"D230","v":"II"},"do 15","0,40",6,8]
["II;II;do 25/0,40","II;II;do 25","II",{"$f":"D231","v":"II"},"do 25","0,40",8,8]
["II;II;do 38/0,40","II;II;do 38","II",{"$f":"D232","v":"II"},"do 38","0,40",8,8]
["II;III;do 10/0,40","II;III;do 10","II","III","do 10","0,40",6,6]
["II;III;do 15/0,40","II;III;do 15","II",{"$f":"D234","v":"III"},"do 15","0,40",6,6]
["II;III;do 25/0,40","II;III;do 25","II",{"$f":"D235","v":"III"},"do 25","0,40",6,6]
["II;III;do 38/0,40","II;III;do 38","II",{"$f":"D236","v":"III"},"do 38","0,40",6,8]
["II;IV;do 10/0,40","II;IV;do 10","II","IV","do 10","0,40",6,6]
["II;IV;do 15/0,40","II;IV;do 15","II",{"$f":"D238","v":"IV"},"do 15","0,40",6,6]
["II;IV;do 25/0,40","II;IV;do 25","II",{"$f":"D239","v":"IV"},"do 25","0,40",6,6]
["II;IV;do 38/0,40","II;IV;do 38","II",{"$f":"D240","v":"IV"},"do 38","0,40",6,6]
["II;I;do 10/0,50","II;I;do 10","II","I","do 10","0,50",6,6]
["II;I;do 15/0,50","II;I;do 15","II",{"$f":"D242","v":"I"},"do 15",{"$f":"F242","v":"0,50"},6,6]
["II;I;do 25/0,50","II;I;do 25","II",{"$f":"D243","v":"I"},"do 25","0,50",8,8]
["II;I;do 38/0,50","II;I;do 38","II",{"$f":"D244","v":"I"},"do 38","0,50",8,8]
["II;II;do 10/0,50","II;II;do 10","II","II","do 10","0,50",6,6]
["II;II;do 15/0,50","II;II;do 15","II",{"$f":"D246","v":"II"},"do 15","0,50",6,6]
["II;II;do 25/0,50","II;II;do 25","II",{"$f":"D247","v":"II"},"do 25","0,50",6,6]
["II;II;do 38/0,50","II;II;do 38","II",{"$f":"D248","v":"II"},"do 38","0,50",8,8]
["II;III;do 10/0,50","II;III;do 10","II","III","do 10","0,50",6,6]
["II;III;do 15/0,50","II;III;do 15","II",{"$f":"D250","v":"III"},"do 15","0,50",6,6]
["II;III;do 25/0,50","II;III;do 25","II",{"$f":"D251","v":"III"},"do 25","0,50",6,6]
["II;III;do 38/0,50","II;III;do 38","II",{"$f":"D252","v":"III"},"do 38","0,50",6,6]
["II;IV;do 10/0,50","II;IV;do 10","II","IV","do 10","0,50",6,6]
["II;IV;do 15/0,50","II;IV;do 15","II",{"$f":"D254","v":"IV"},"do 15","0,50",6,6]
["II;IV;do 25/0,50","II;IV;do 25","II",{"$f":"D255","v":"IV"},"do 25","0,50",6,6]
["II;IV;do 38/0,50","II;IV;do 38","II",{"$f":"D256","v":"IV"},"do 38","0,50",6,6]
[{"$f":"B258&\"/\"&F258","v":"III;I;do 10/0,10"},{"$f":"C258&\";\"&D258&\";\"&E258","v":"III;I;do 10"},"III","I","do 10","0,10","–","–"]
["III;I;do 15/0,10","III;I;do 15","III",{"$f":"D258","v":"I"},"do 15",{"$f":"F258","v":"0,10"},"–","–"]
["III;I;do 25/0,10","III;I;do 25","III",{"$f":"D259","v":"I"},"do 25","0,10","–","–"]
["III;I;do 38/0,10","III;I;do 38","III",{"$f":"D260","v":"I"},"do 38","0,10","–","–"]
["III;II;do 10/0,10","III;II;do 10","III","II","do 10","0,10","–","–"]
["III;II;do 15/0,10","III;II;do 15","III",{"$f":"D262","v":"II"},"do 15","0,10","–","–"]
["III;II;do 25/0,10","III;II;do 25","III",{"$f":"D263","v":"II"},"do 25","0,10","–","–"]
["III;II;do 38/0,10","III;II;do 38","III",{"$f":"D264","v":"II"},"do 38","0,10","–","–"]
["III;III;do 10/0,10","III;III;do 10","III","III","do 10","0,10","–","–"]
["III;III;do 15/0,10","III;III;do 15","III",{"$f":"D266","v":"III"},"do 15","0,10","–","–"]
["III;III;do 25/0,10","III;III;do 25","III",{"$f":"D267","v":"III"},"do 25","0,10","–","–"]
["III;III;do 38/0,10","III;III;do 38","III",{"$f":"D268","v":"III"},"do 38","0,10","–","–"]
["III;IV;do 10/0,10","III;IV;do 10","III","IV","do 10","0,10",12,{"$f":"IF(ecotwist,\"–\",16)","v":16}]
["III;IV;do 15/0,10","III;IV;do 15","III",{"$f":"D270","v":"IV"},"do 15","0,10",{"$f":"IF(ecotwist,\"–\",16)","v":16},"–"]
["III;IV;do 25/0,10","III;IV;do 25","III",{"$f":"D271","v":"IV"},"do 25","0,10","–","–"]
["III;IV;do 38/0,10","III;IV;do 38","III",{"$f":"D272","v":"IV"},"do 38","0,10","–","–"]
["III;I;do 10/0,12","III;I;do 10","III","I","do 10","0,12","–","–"]
["III;I;do 15/0,12","III;I;do 15","III",{"$f":"D274","v":"I"},"do 15",{"$f":"F274","v":"0,12"},"–","–"]
["III;I;do 25/0,12","III;I;do 25","III",{"$f":"D275","v":"I"},"do 25","0,12","–","–"]
["III;I;do 38/0,12","III;I;do 38","III",{"$f":"D276","v":"I"},"do 38","0,12","–","–"]
["III;II;do 10/0,12","III;II;do 10","III","II","do 10","0,12","–","–"]
["III;II;do 15/0,12","III;II;do 15","III",{"$f":"D278","v":"II"},"do 15","0,12","–","–"]
["III;II;do 25/0,12","III;II;do 25","III",{"$f":"D279","v":"II"},"do 25","0,12","–","–"]
["III;II;do 38/0,12","III;II;do 38","III",{"$f":"D280","v":"II"},"do 38","0,12","–","–"]
["III;III;do 10/0,12","III;III;do 10","III","III","do 10","0,12",{"$f":"IF(ecotwist,\"–\",16)","v":16},"–"]
["III;III;do 15/0,12","III;III;do 15","III",{"$f":"D282","v":"III"},"do 15","0,12","–","–"]
["III;III;do 25/0,12","III;III;do 25","III",{"$f":"D283","v":"III"},"do 25","0,12","–","–"]
["III;III;do 38/0,12","III;III;do 38","III",{"$f":"D284","v":"III"},"do 38","0,12","–","–"]
["III;IV;do 10/0,12","III;IV;do 10","III","IV","do 10","0,12",10,12]
["III;IV;do 15/0,12","III;IV;do 15","III",{"$f":"D286","v":"IV"},"do 15","0,12",12,{"$f":"IF(ecotwist,\"–\",16)","v":16}]
["III;IV;do 25/0,12","III;IV;do 25","III",{"$f":"D287","v":"IV"},"do 25","0,12",{"$f":"IF(ecotwist,\"–\",16)","v":16},"–"]
["III;IV;do 38/0,12","III;IV;do 38","III",{"$f":"D288","v":"IV"},"do 38","0,12","–","–"]
["III;I;do 10/0,15","III;I;do 10","III","I","do 10","0,15","–","–"]
["III;I;do 15/0,15","III;I;do 15","III",{"$f":"D290","v":"I"},"do 15",{"$f":"F290","v":"0,15"},"–","–"]
["III;I;do 25/0,15","III;I;do 25","III",{"$f":"D291","v":"I"},"do 25","0,15","–","–"]
["III;I;do 38/0,15","III;I;do 38","III",{"$f":"D292","v":"I"},"do 38","0,15","–","–"]
["III;II;do 10/0,15","III;II;do 10","III","II","do 10","0,15",{"$f":"IF(ecotwist,\"–\",16)","v":16},"–"]
["III;II;do 15/0,15","III;II;do 15","III",{"$f":"D294","v":"II"},"do 15","0,15","–","–"]
["III;II;do 25/0,15","III;II;do 25","III",{"$f":"D295","v":"II"},"do 25","0,15","–","–"]
["III;II;do 38/0,15","III;II;do 38","III",{"$f":"D296","v":"II"},"do 38","0,15","–","–"]
["III;III;do 10/0,15","III;III;do 10","III","III","do 10","0,15",12,{"$f":"IF(ecotwist,\"–\",14)","v":14}]
["III;III;do 15/0,15","III;III;do 15","III",{"$f":"D298","v":"III"},"do 15","0,15",{"$f":"IF(ecotwist,\"–\",14)","v":14},{"$f":"IF(ecotwist,\"–\",16)","v":16}]
["III;III;do 25/0,15","III;III;do 25","III",{"$f":"D299","v":"III"},"do 25","0,15",{"$f":"IF(ecotwist,\"–\",16)","v":16},"–"]
["III;III;do 38/0,15","III;III;do 38","III",{"$f":"D300","v":"III"},"do 38","0,15","–","–"]
["III;IV;do 10/0,15","III;IV;do 10","III","IV","do 10","0,15",8,10]
["III;IV;do 15/0,15","III;IV;do 15","III",{"$f":"D302","v":"IV"},"do 15","0,15",10,12]
["III;IV;do 25/0,15","III;IV;do 25","III",{"$f":"D303","v":"IV"},"do 25","0,15",{"$f":"IF(ecotwist,\"–\",14)","v":14},{"$f":"IF(ecotwist,\"–\",16)","v":16}]
["III;IV;do 38/0,15","III;IV;do 38","III",{"$f":"D304","v":"IV"},"do 38","0,15",{"$f":"IF(ecotwist,\"–\",14)","v":14},"–"]
["III;I;do 10/0,20","III;I;do 10","III","I","do 10","0,20",{"$f":"IF(ecotwist,\"–\",14)","v":14},"–"]
["III;I;do 15/0,20","III;I;do 15","III",{"$f":"D306","v":"I"},"do 15",{"$f":"F306","v":"0,20"},{"$f":"IF(ecotwist,\"–\",16)","v":16},"–"]
["III;I;do 25/0,20","III;I;do 25","III",{"$f":"D307","v":"I"},"do 25","0,20","–","–"]
["III;I;do 38/0,20","III;I;do 38","III",{"$f":"D308","v":"I"},"do 38","0,20","–","–"]
["III;II;do 10/0,20","III;II;do 10","III","II","do 10","0,20",12,{"$f":"IF(ecotwist,\"–\",16)","v":16}]
["III;II;do 15/0,20","III;II;do 15","III",{"$f":"D310","v":"II"},"do 15","0,20",{"$f":"IF(ecotwist,\"–\",14)","v":14},{"$f":"IF(ecotwist,\"–\",16)","v":16}]
["III;II;do 25/0,20","III;II;do 25","III",{"$f":"D311","v":"II"},"do 25","0,20",{"$f":"IF(ecotwist,\"–\",16)","v":16},"–"]
["III;II;do 38/0,20","III;II;do 38","III",{"$f":"D312","v":"II"},"do 38","0,20","–","–"]
["III;III;do 10/0,20","III;III;do 10","III","III","do 10","0,20",10,12]
["III;III;do 15/0,20","III;III;do 15","III",{"$f":"D314","v":"III"},"do 15","0,20",10,12]
["III;III;do 25/0,20","III;III;do 25","III",{"$f":"D315","v":"III"},"do 25","0,20",12,{"$f":"IF(ecotwist,\"–\",14)","v":14}]
["III;III;do 38/0,20","III;III;do 38","III",{"$f":"D316","v":"III"},"do 38","0,20",{"$f":"IF(ecotwist,\"–\",14)","v":14},{"$f":"IF(ecotwist,\"–\",16)","v":16}]
["III;IV;do 10/0,20","III;IV;do 10","III","IV","do 10","0,20",6,8]
["III;IV;do 15/0,20","III;IV;do 15","III",{"$f":"D318","v":"IV"},"do 15","0,20",8,10]
["III;IV;do 25/0,20","III;IV;do 25","III",{"$f":"D319","v":"IV"},"do 25","0,20",10,12]
["III;IV;do 38/0,20","III;IV;do 38","III",{"$f":"D320","v":"IV"},"do 38","0,20",12,{"$f":"IF(ecotwist,\"–\",14)","v":14}]
[{"$f":"B322&\"/\"&F322","v":"III;I;do 10/0,25"},{"$f":"C322&\";\"&D322&\";\"&E322","v":"III;I;do 10"},"III","I","do 10","0,25",12,{"$f":"IF(ecotwist,\"–\",14)","v":14}]
["III;I;do 15/0,25","III;I;do 15","III",{"$f":"D322","v":"I"},"do 15",{"$f":"F322","v":"0,25"},12,{"$f":"IF(ecotwist,\"–\",16)","v":16}]
["III;I;do 25/0,25","III;I;do 25","III",{"$f":"D323","v":"I"},"do 25","0,25",{"$f":"IF(ecotwist,\"–\",14)","v":14},{"$f":"IF(ecotwist,\"–\",16)","v":16}]
["III;I;do 38/0,25","III;I;do 38","III",{"$f":"D324","v":"I"},"do 38","0,25",{"$f":"IF(ecotwist,\"–\",16)","v":16},"–"]
["III;II;do 10/0,25","III;II;do 10","III","II","do 10","0,25",10,12]
["III;II;do 15/0,25","III;II;do 15","III",{"$f":"D326","v":"II"},"do 15","0,25",12,{"$f":"IF(ecotwist,\"–\",14)","v":14}]
["III;II;do 25/0,25","III;II;do 25","III",{"$f":"D327","v":"II"},"do 25","0,25",12,{"$f":"IF(ecotwist,\"–\",16)","v":16}]
["III;II;do 38/0,25","III;II;do 38","III",{"$f":"D328","v":"II"},"do 38","0,25",{"$f":"IF(ecotwist,\"–\",14)","v":14},{"$f":"IF(ecotwist,\"–\",16)","v":16}]
["III;III;do 10/0,25","III;III;do 10","III","III","do 10","0,25",8,10]
["III;III;do 15/0,25","III;III;do 15","III",{"$f":"D330","v":"III"},"do 15","0,25",8,10]
["III;III;do 25/0,25","III;III;do 25","III",{"$f":"D331","v":"III"},"do 25","0,25",10,12]
["III;III;do 38/0,25","III;III;do 38","III",{"$f":"D332","v":"III"},"do 38","0,25",12,{"$f":"IF(ecotwist,\"–\",14)","v":14}]
["III;IV;do 10/0,25","III;IV;do 10","III","IV","do 10","0,25",6,6]
["III;IV;do 15/0,25","III;IV;do 15","III",{"$f":"D334","v":"IV"},"do 15","0,25",6,8]
["III;IV;do 25/0,25","III;IV;do 25","III",{"$f":"D335","v":"IV"},"do 25","0,25",8,10]
["III;IV;do 38/0,25","III;IV;do 38","III",{"$f":"D336","v":"IV"},"do 38","0,25",10,12]
["III;I;do 10/0,30","III;I;do 10","III","I","do 10","0,30",10,12]
["III;I;do 15/0,30","III;I;do 15","III",{"$f":"D338","v":"I"},"do 15",{"$f":"F338","v":"0,30"},10,12]
["III;I;do 25/0,30","III;I;do 25","III",{"$f":"D339","v":"I"},"do 25","0,30",12,{"$f":"IF(ecotwist,\"–\",14)","v":14}]
["III;I;do 38/0,30","III;I;do 38","III",{"$f":"D340","v":"I"},"do 38","0,30",12,{"$f":"IF(ecotwist,\"–\",16)","v":16}]
["III;II;do 10/0,30","III;II;do 10","III","II","do 10","0,30",8,10]
["III;II;do 15/0,30","III;II;do 15","III",{"$f":"D342","v":"II"},"do 15","0,30",10,12]
["III;II;do 25/0,30","III;II;do 25","III",{"$f":"D343","v":"II"},"do 25","0,30",10,12]
["III;II;do 38/0,30","III;II;do 38","III",{"$f":"D344","v":"II"},"do 38","0,30",12,{"$f":"IF(ecotwist,\"–\",14)","v":14}]
["III;III;do 10/0,30","III;III;do 10","III","III","do 10","0,30",6,8]
["III;III;do 15/0,30","III;III;do 15","III",{"$f":"D346","v":"III"},"do 15","0,30",8,8]
["III;III;do 25/0,30","III;III;do 25","III",{"$f":"D347","v":"III"},"do 25","0,30",8,10]
["III;III;do 38/0,30","III;III;do 38","III",{"$f":"D348","v":"III"},"do 38","0,30",10,12]
["III;IV;do 10/0,30","III;IV;do 10","III","IV","do 10","0,30",6,6]
["III;IV;do 15/0,30","III;IV;do 15","III",{"$f":"D350","v":"IV"},"do 15","0,30",6,6]
["III;IV;do 25/0,30","III;IV;do 25","III",{"$f":"D351","v":"IV"},"do 25","0,30",8,8]
["III;IV;do 38/0,30","III;IV;do 38","III",{"$f":"D352","v":"IV"},"do 38","0,30",8,10]
["III;I;do 10/0,40","III;I;do 10","III","I","do 10","0,40",8,10]
["III;I;do 15/0,40","III;I;do 15","III",{"$f":"D354","v":"I"},"do 15",{"$f":"F354","v":"0,40"},8,10]
["III;I;do 25/0,40","III;I;do 25","III",{"$f":"D355","v":"I"},"do 25","0,40",10,10]
["III;I;do 38/0,40","III;I;do 38","III",{"$f":"D356","v":"I"},"do 38","0,40",10,12]
["III;II;do 10/0,40","III;II;do 10","III","II","do 10","0,40",6,8]
["III;II;do 15/0,40","III;II;do 15","III",{"$f":"D358","v":"II"},"do 15","0,40",8,8]
["III;II;do 25/0,40","III;II;do 25","III",{"$f":"D359","v":"II"},"do 25","0,40",8,10]
["III;II;do 38/0,40","III;II;do 38","III",{"$f":"D360","v":"II"},"do 38","0,40",10,10]
["III;III;do 10/0,40","III;III;do 10","III","III","do 10","0,40",6,6]
["III;III;do 15/0,40","III;III;do 15","III",{"$f":"D362","v":"III"},"do 15","0,40",6,6]
["III;III;do 25/0,40","III;III;do 25","III",{"$f":"D363","v":"III"},"do 25","0,40",6,8]
["III;III;do 38/0,40","III;III;do 38","III",{"$f":"D364","v":"III"},"do 38","0,40",8,8]
["III;IV;do 10/0,40","III;IV;do 10","III","IV","do 10","0,40",6,6]
["III;IV;do 15/0,40","III;IV;do 15","III",{"$f":"D366","v":"IV"},"do 15","0,40",6,6]
["III;IV;do 25/0,40","III;IV;do 25","III",{"$f":"D367","v":"IV"},"do 25","0,40",6,6]
["III;IV;do 38/0,40","III;IV;do 38","III",{"$f":"D368","v":"IV"},"do 38","0,40",6,8]
["III;I;do 10/0,50","III;I;do 10","III","I","do 10","0,50",6,8]
["III;I;do 15/0,50","III;I;do 15","III",{"$f":"D370","v":"I"},"do 15",{"$f":"F370","v":"0,50"},6,8]
["III;I;do 25/0,50","III;I;do 25","III",{"$f":"D371","v":"I"},"do 25","0,50",6,8]
["III;I;do 38/0,50","III;I;do 38","III",{"$f":"D372","v":"I"},"do 38","0,50",6,10]
["III;II;do 10/0,50","III;II;do 10","III","II","do 10","0,50",6,6]
["III;II;do 15/0,50","III;II;do 15","III",{"$f":"D374","v":"II"},"do 15","0,50",6,8]
["III;II;do 25/0,50","III;II;do 25","III",{"$f":"D375","v":"II"},"do 25","0,50",6,8]
["III;II;do 38/0,50","III;II;do 38","III",{"$f":"D376","v":"II"},"do 38","0,50",6,8]
["III;III;do 10/0,50","III;III;do 10","III","III","do 10","0,50",6,6]
["III;III;do 15/0,50","III;III;do 15","III",{"$f":"D378","v":"III"},"do 15","0,50",6,6]
["III;III;do 25/0,50","III;III;do 25","III",{"$f":"D379","v":"III"},"do 25","0,50",6,6]
["III;III;do 38/0,50","III;III;do 38","III",{"$f":"D380","v":"III"},"do 38","0,50",6,8]
["III;IV;do 10/0,50","III;IV;do 10","III","IV","do 10","0,50",6,6]
["III;IV;do 15/0,50","III;IV;do 15","III",{"$f":"D382","v":"IV"},"do 15","0,50",6,6]
["III;IV;do 25/0,50","III;IV;do 25","III",{"$f":"D383","v":"IV"},"do 25","0,50",6,6]
["III;IV;do 38/0,50","III;IV;do 38","III",{"$f":"D384","v":"IV"},"do 38","0,50",6,6]
[{"$f":"B386&\"/\"&F386","v":"IV;I;do 10/0,10"},{"$f":"C386&\";\"&D386&\";\"&E386","v":"IV;I;do 10"},"IV","I","do 10","0,10","–","–"]
["IV;I;do 15/0,10","IV;I;do 15","IV",{"$f":"D386","v":"I"},"do 15",{"$f":"F386","v":"0,10"},"–","–"]
["IV;I;do 25/0,10","IV;I;do 25","IV",{"$f":"D387","v":"I"},"do 25","0,10","–","–"]
["IV;I;do 38/0,10","IV;I;do 38","IV",{"$f":"D388","v":"I"},"do 38","0,10","–","–"]
["IV;II;do 10/0,10","IV;II;do 10","IV","II","do 10","0,10","–","–"]
["IV;II;do 15/0,10","IV;II;do 15","IV",{"$f":"D390","v":"II"},"do 15","0,10","–","–"]
["IV;II;do 25/0,10","IV;II;do 25","IV",{"$f":"D391","v":"II"},"do 25","0,10","–","–"]
["IV;II;do 38/0,10","IV;II;do 38","IV",{"$f":"D392","v":"II"},"do 38","0,10","–","–"]
["IV;III;do 10/0,10","IV;III;do 10","IV","III","do 10","0,10","–","–"]
["IV;III;do 15/0,10","IV;III;do 15","IV",{"$f":"D394","v":"III"},"do 15","0,10","–","–"]
["IV;III;do 25/0,10","IV;III;do 25","IV",{"$f":"D395","v":"III"},"do 25","0,10","–","–"]
["IV;III;do 38/0,10","IV;III;do 38","IV",{"$f":"D396","v":"III"},"do 38","0,10","–","–"]
["IV;IV;do 10/0,10","IV;IV;do 10","IV","IV","do 10","0,10",{"$f":"IF(ecotwist,\"–\",14)","v":14},"–"]
["IV;IV;do 15/0,10","IV;IV;do 15","IV",{"$f":"D398","v":"IV"},"do 15","0,10","–","–"]
["IV;IV;do 25/0,10","IV;IV;do 25","IV",{"$f":"D399","v":"IV"},"do 25","0,10","–","–"]
["IV;IV;do 38/0,10","IV;IV;do 38","IV",{"$f":"D400","v":"IV"},"do 38","0,10","–","–"]
["IV;I;do 10/0,12","IV;I;do 10","IV","I","do 10","0,12","–","–"]
["IV;I;do 15/0,12","IV;I;do 15","IV",{"$f":"D402","v":"I"},"do 15",{"$f":"F402","v":"0,12"},"–","–"]
["IV;I;do 25/0,12","IV;I;do 25","IV",{"$f":"D403","v":"I"},"do 25","0,12","–","–"]
["IV;I;do 38/0,12","IV;I;do 38","IV",{"$f":"D404","v":"I"},"do 38","0,12","–","–"]
["IV;II;do 10/0,12","IV;II;do 10","IV","II","do 10","0,12","–","–"]
["IV;II;do 15/0,12","IV;II;do 15","IV",{"$f":"D406","v":"II"},"do 15","0,12","–","–"]
["IV;II;do 25/0,12","IV;II;do 25","IV",{"$f":"D407","v":"II"},"do 25","0,12","–","–"]
["IV;II;do 38/0,12","IV;II;do 38","IV",{"$f":"D408","v":"II"},"do 38","0,12","–","–"]
["IV;III;do 10/0,12","IV;III;do 10","IV","III","do 10","0,12","–","–"]
["IV;III;do 15/0,12","IV;III;do 15","IV",{"$f":"D410","v":"III"},"do 15","0,12","–","–"]
["IV;III;do 25/0,12","IV;III;do 25","IV",{"$f":"D411","v":"III"},"do 25","0,12","–","–"]
["IV;III;do 38/0,12","IV;III;do 38","IV",{"$f":"D412","v":"III"},"do 38","0,12","–","–"]
["IV;IV;do 10/0,12","IV;IV;do 10","IV","IV","do 10","0,12",12,{"$f":"IF(ecotwist,\"–\",14)","v":14}]
["IV;IV;do 15/0,12","IV;IV;do 15","IV",{"$f":"D414","v":"IV"},"do 15","0,12",{"$f":"IF(ecotwist,\"–\",16)","v":16},"–"]
["IV;IV;do 25/0,12","IV;IV;do 25","IV",{"$f":"D415","v":"IV"},"do 25","0,12","–","–"]
["IV;IV;do 38/0,12","IV;IV;do 38","IV",{"$f":"D416","v":"IV"},"do 38","0,12","–","–"]
["IV;I;do 10/0,15","IV;I;do 10","IV","I","do 10","0,15","–","–"]
["IV;I;do 15/0,15","IV;I;do 15","IV",{"$f":"D418","v":"I"},"do 15",{"$f":"F418","v":"0,15"},"–","–"]
["IV;I;do 25/0,15","IV;I;do 25","IV",{"$f":"D419","v":"I"},"do 25","0,15","–","–"]
["IV;I;do 38/0,15","IV;I;do 38","IV",{"$f":"D420","v":"I"},"do 38","0,15","–","–"]
["IV;II;do 10/0,15","IV;II;do 10","IV","II","do 10","0,15","–","–"]
["IV;II;do 15/0,15","IV;II;do 15","IV",{"$f":"D422","v":"II"},"do 15","0,15","–","–"]
["IV;II;do 25/0,15","IV;II;do 25","IV",{"$f":"D423","v":"II"},"do 25","0,15","–","–"]
["IV;II;do 38/0,15","IV;II;do 38","IV",{"$f":"D424","v":"II"},"do 38","0,15","–","–"]
["IV;III;do 10/0,15","IV;III;do 10","IV","III","do 10","0,15",{"$f":"IF(ecotwist,\"–\",14)","v":14},"–"]
["IV;III;do 15/0,15","IV;III;do 15","IV",{"$f":"D426","v":"III"},"do 15","0,15",{"$f":"IF(ecotwist,\"–\",16)","v":16},"–"]
["IV;III;do 25/0,15","IV;III;do 25","IV",{"$f":"D427","v":"III"},"do 25","0,15","–","–"]
["IV;III;do 38/0,15","IV;III;do 38","IV",{"$f":"D428","v":"III"},"do 38","0,15","–","–"]
["IV;IV;do 10/0,15","IV;IV;do 10","IV","IV","do 10","0,15",10,12]
["IV;IV;do 15/0,15","IV;IV;do 15","IV",{"$f":"D430","v":"IV"},"do 15","0,15",12,{"$f":"IF(ecotwist,\"–\",14)","v":14}]
["IV;IV;do 25/0,15","IV;IV;do 25","IV",{"$f":"D431","v":"IV"},"do 25","0,15",{"$f":"IF(ecotwist,\"–\",16)","v":16},"–"]
["IV;IV;do 38/0,15","IV;IV;do 38","IV",{"$f":"D432","v":"IV"},"do 38","0,15","–","–"]
["IV;I;do 10/0,20","IV;I;do 10","IV","I","do 10","0,20","–","–"]
["IV;I;do 15/0,20","IV;I;do 15","IV",{"$f":"D434","v":"I"},"do 15",{"$f":"F434","v":"0,20"},"–","–"]
["IV;I;do 25/0,20","IV;I;do 25","IV",{"$f":"D435","v":"I"},"do 25","0,20","–","–"]
["IV;I;do 38/0,20","IV;I;do 38","IV",{"$f":"D436","v":"I"},"do 38","0,20","–","–"]
["IV;II;do 10/0,20","IV;II;do 10","IV","II","do 10","0,20",{"$f":"IF(ecotwist,\"–\",14)","v":14},"–"]
["IV;II;do 15/0,20","IV;II;do 15","IV",{"$f":"D438","v":"II"},"do 15","0,20",{"$f":"IF(ecotwist,\"–\",16)","v":16},"–"]
["IV;II;do 25/0,20","IV;II;do 25","IV",{"$f":"D439","v":"II"},"do 25","0,20","–","–"]
["IV;II;do 38/0,20","IV;II;do 38","IV",{"$f":"D440","v":"II"},"do 38","0,20","–","–"]
["IV;III;do 10/0,20","IV;III;do 10","IV","III","do 10","0,20",12,{"$f":"IF(ecotwist,\"–\",14)","v":14}]
["IV;III;do 15/0,20","IV;III;do 15","IV",{"$f":"D442","v":"III"},"do 15","0,20",12,{"$f":"IF(ecotwist,\"–\",16)","v":16}]
["IV;III;do 25/0,20","IV;III;do 25","IV",{"$f":"D443","v":"III"},"do 25","0,20",{"$f":"IF(ecotwist,\"–\",16)","v":16},"–"]
["IV;III;do 38/0,20","IV;III;do 38","IV",{"$f":"D444","v":"III"},"do 38","0,20",{"$f":"IF(ecotwist,\"–\",16)","v":16},"–"]
["IV;IV;do 10/0,20","IV;IV;do 10","IV","IV","do 10","0,20",8,10]
["IV;IV;do 15/0,20","IV;IV;do 15","IV",{"$f":"D446","v":"IV"},"do 15","0,20",10,12]
["IV;IV;do 25/0,20","IV;IV;do 25","IV",{"$f":"D447","v":"IV"},"do 25","0,20",12,{"$f":"IF(ecotwist,\"–\",14)","v":14}]
["IV;IV;do 38/0,20","IV;IV;do 38","IV",{"$f":"D448","v":"IV"},"do 38","0,20",{"$f":"IF(ecotwist,\"–\",14)","v":14},{"$f":"IF(ecotwist,\"–\",16)","v":16}]
[{"$f":"B450&\"/\"&F450","v":"IV;I;do 10/0,25"},{"$f":"C450&\";\"&D450&\";\"&E450","v":"IV;I;do 10"},"IV","I","do 10","0,25",{"$f":"IF(ecotwist,\"–\",14)","v":14},{"$f":"IF(ecotwist,\"–\",16)","v":16}]
["IV;I;do 15/0,25","IV;I;do 15","IV",{"$f":"D450","v":"I"},"do 15",{"$f":"F450","v":"0,25"},{"$f":"IF(ecotwist,\"–\",16)","v":16},"–"]
["IV;I;do 25/0,25","IV;I;do 25","IV",{"$f":"D451","v":"I"},"do 25","0,25",{"$f":"IF(ecotwist,\"–\",16)","v":16},"–"]
["IV;I;do 38/0,25","IV;I;do 38","IV",{"$f":"D452","v":"I"},"do 38","0,25","–","–"]
["IV;II;do 10/0,25","IV;II;do 10","IV","II","do 10","0,25",12,{"$f":"IF(ecotwist,\"–\",14)","v":14}]
["IV;II;do 15/0,25","IV;II;do 15","IV",{"$f":"D454","v":"II"},"do 15","0,25",{"$f":"IF(ecotwist,\"–\",14)","v":14},{"$f":"IF(ecotwist,\"–\",16)","v":16}]
["IV;II;do 25/0,25","IV;II;do 25","IV",{"$f":"D455","v":"II"},"do 25","0,25",{"$f":"IF(ecotwist,\"–\",16)","v":16},"–"]
["IV;II;do 38/0,25","IV;II;do 38","IV",{"$f":"D456","v":"II"},"do 38","0,25",{"$f":"IF(ecotwist,\"–\",16)","v":16},"–"]
["IV;III;do 10/0,25","IV;III;do 10","IV","III","do 10","0,25",10,10]
["IV;III;do 15/0,25","IV;III;do 15","IV",{"$f":"D458","v":"III"},"do 15","0,25",10,12]
["IV;III;do 25/0,25","IV;III;do 25","IV",{"$f":"D459","v":"III"},"do 25","0,25",12,{"$f":"IF(ecotwist,\"–\",14)","v":14}]
["IV;III;do 38/0,25","IV;III;do 38","IV",{"$f":"D460","v":"III"},"do 38","0,25",{"$f":"IF(ecotwist,\"–\",14)","v":14},{"$f":"IF(ecotwist,\"–\",16)","v":16}]
["IV;IV;do 10/0,25","IV;IV;do 10","IV","IV","do 10","0,25",6,8]
["IV;IV;do 15/0,25","IV;IV;do 15","IV",{"$f":"D462","v":"IV"},"do 15","0,25",8,10]
["IV;IV;do 25/0,25","IV;IV;do 25","IV",{"$f":"D463","v":"IV"},"do 25","0,25",10,12]
["IV;IV;do 38/0,25","IV;IV;do 38","IV",{"$f":"D464","v":"IV"},"do 38","0,25",10,12]
["IV;I;do 10/0,30","IV;I;do 10","IV","I","do 10","0,30",12,{"$f":"IF(ecotwist,\"–\",14)","v":14}]
["IV;I;do 15/0,30","IV;I;do 15","IV",{"$f":"D466","v":"I"},"do 15",{"$f":"F466","v":"0,30"},12,{"$f":"IF(ecotwist,\"–\",16)","v":16}]
["IV;I;do 25/0,30","IV;I;do 25","IV",{"$f":"D467","v":"I"},"do 25","0,30",{"$f":"IF(ecotwist,\"–\",14)","v":14},{"$f":"IF(ecotwist,\"–\",16)","v":16}]
["IV;I;do 38/0,30","IV;I;do 38","IV",{"$f":"D468","v":"I"},"do 38","0,30",{"$f":"IF(ecotwist,\"–\",16)","v":16},"–"]
["IV;II;do 10/0,30","IV;II;do 10","IV","II","do 10","0,30",10,12]
["IV;II;do 15/0,30","IV;II;do 15","IV",{"$f":"D470","v":"II"},"do 15","0,30",12,{"$f":"IF(ecotwist,\"–\",14)","v":14}]
["IV;II;do 25/0,30","IV;II;do 25","IV",{"$f":"D471","v":"II"},"do 25","0,30",12,{"$f":"IF(ecotwist,\"–\",16)","v":16}]
["IV;II;do 38/0,30","IV;II;do 38","IV",{"$f":"D472","v":"II"},"do 38","0,30",{"$f":"IF(ecotwist,\"–\",14)","v":14},{"$f":"IF(ecotwist,\"–\",16)","v":16}]
["IV;III;do 10/0,30","IV;III;do 10","IV","III","do 10","0,30",8,10]
["IV;III;do 15/0,30","IV;III;do 15","IV",{"$f":"D474","v":"III"},"do 15","0,30",8,10]
["IV;III;do 25/0,30","IV;III;do 25","IV",{"$f":"D475","v":"III"},"do 25","0,30",10,12]
["IV;III;do 38/0,30","IV;III;do 38","IV",{"$f":"D476","v":"III"},"do 38","0,30",12,{"$f":"IF(ecotwist,\"–\",14)","v":14}]
["IV;IV;do 10/0,30","IV;IV;do 10","IV","IV","do 10","0,30",6,6]
["IV;IV;do 15/0,30","IV;IV;do 15","IV",{"$f":"D478","v":"IV"},"do 15","0,30",6,8]
["IV;IV;do 25/0,30","IV;IV;do 25","IV",{"$f":"D479","v":"IV"},"do 25","0,30",8,10]
["IV;IV;do 38/0,30","IV;IV;do 38","IV",{"$f":"D480","v":"IV"},"do 38","0,30",10,10]
["IV;I;do 10/0,40","IV;I;do 10","IV","I","do 10","0,40",10,10]
["IV;I;do 15/0,40","IV;I;do 15","IV",{"$f":"D482","v":"I"},"do 15",{"$f":"F482","v":"0,40"},10,12]
["IV;I;do 25/0,40","IV;I;do 25","IV",{"$f":"D483","v":"I"},"do 25","0,40",10,12]
["IV;I;do 38/0,40","IV;I;do 38","IV",{"$f":"D484","v":"I"},"do 38","0,40",12,{"$f":"IF(ecotwist,\"–\",14)","v":14}]
["IV;II;do 10/0,40","IV;II;do 10","IV","II","do 10","0,40",8,10]
["IV;II;do 15/0,40","IV;II;do 15","IV",{"$f":"D486","v":"II"},"do 15","0,40",8,10]
["IV;II;do 25/0,40","IV;II;do 25","IV",{"$f":"D487","v":"II"},"do 25","0,40",10,12]
["IV;II;do 38/0,40","IV;II;do 38","IV",{"$f":"D488","v":"II"},"do 38","0,40",10,12]
["IV;III;do 10/0,40","IV;III;do 10","IV","III","do 10","0,40",6,8]
["IV;III;do 15/0,40","IV;III;do 15","IV",{"$f":"D490","v":"III"},"do 15","0,40",6,8]
["IV;III;do 25/0,40","IV;III;do 25","IV",{"$f":"D491","v":"III"},"do 25","0,40",8,10]
["IV;III;do 38/0,40","IV;III;do 38","IV",{"$f":"D492","v":"III"},"do 38","0,40",8,10]
["IV;IV;do 10/0,40","IV;IV;do 10","IV","IV","do 10","0,40",6,6]
["IV;IV;do 15/0,40","IV;IV;do 15","IV",{"$f":"D494","v":"IV"},"do 15","0,40",6,6]
["IV;IV;do 25/0,40","IV;IV;do 25","IV",{"$f":"D495","v":"IV"},"do 25","0,40",6,8]
["IV;IV;do 38/0,40","IV;IV;do 38","IV",{"$f":"D496","v":"IV"},"do 38","0,40",8,8]
["IV;I;do 10/0,50","IV;I;do 10","IV","I","do 10","0,50",8,8]
["IV;I;do 15/0,50","IV;I;do 15","IV",{"$f":"D498","v":"I"},"do 15",{"$f":"F498","v":"0,50"},8,10]
["IV;I;do 25/0,50","IV;I;do 25","IV",{"$f":"D499","v":"I"},"do 25","0,50",8,10]
["IV;I;do 38/0,50","IV;I;do 38","IV",{"$f":"D500","v":"I"},"do 38","0,50",10,12]
["IV;II;do 10/0,50","IV;II;do 10","IV","II","do 10","0,50",6,8]
["IV;II;do 15/0,50","IV;II;do 15","IV",{"$f":"D502","v":"II"},"do 15","0,50",8,8]
["IV;II;do 25/0,50","IV;II;do 25","IV",{"$f":"D503","v":"II"},"do 25","0,50",8,10]
["IV;II;do 38/0,50","IV;II;do 38","IV",{"$f":"D504","v":"II"},"do 38","0,50",8,10]
["IV;III;do 10/0,50","IV;III;do 10","IV","III","do 10","0,50",6,6]
["IV;III;do 15/0,50","IV;III;do 15","IV",{"$f":"D506","v":"III"},"do 15","0,50",6,6]
["IV;III;do 25/0,50","IV;III;do 25","IV",{"$f":"D507","v":"III"},"do 25","0,50",6,8]
["IV;III;do 38/0,50","IV;III;do 38","IV",{"$f":"D508","v":"III"},"do 38","0,50",8,8]
["IV;IV;do 10/0,50","IV;IV;do 10","IV","IV","do 10","0,50",6,6]
["IV;IV;do 15/0,50","IV;IV;do 15","IV",{"$f":"D510","v":"IV"},"do 15","0,50",6,6]
["IV;IV;do 25/0,50","IV;IV;do 25","IV",{"$f":"D511","v":"IV"},"do 25","0,50",6,6]
["IV;IV;do 38/0,50","IV;IV;do 38","IV",{"$f":"D512","v":"IV"},"do 38","0,50",6,6]
[{"$f":"B514&\"/\"&F514","v":"V;I;do 10/0,10"},{"$f":"C514&\";\"&D514&\";\"&E514","v":"V;I;do 10"},"V","I","do 10","0,10","–","–"]
["V;I;do 15/0,10","V;I;do 15","V",{"$f":"D514","v":"I"},"do 15",{"$f":"F514","v":"0,10"},"–","–"]
["V;I;do 25/0,10","V;I;do 25","V",{"$f":"D515","v":"I"},"do 25","0,10","–","–"]
["V;I;do 38/0,10","V;I;do 38","V",{"$f":"D516","v":"I"},"do 38","0,10","–","–"]
["V;II;do 10/0,10","V;II;do 10","V","II","do 10","0,10","–","–"]
["V;II;do 15/0,10","V;II;do 15","V",{"$f":"D518","v":"II"},"do 15","0,10","–","–"]
["V;II;do 25/0,10","V;II;do 25","V",{"$f":"D519","v":"II"},"do 25","0,10","–","–"]
["V;II;do 38/0,10","V;II;do 38","V",{"$f":"D520","v":"II"},"do 38","0,10","–","–"]
["V;III;do 10/0,10","V;III;do 10","V","III","do 10","0,10","–","–"]
["V;III;do 15/0,10","V;III;do 15","V",{"$f":"D522","v":"III"},"do 15","0,10","–","–"]
["V;III;do 25/0,10","V;III;do 25","V",{"$f":"D523","v":"III"},"do 25","0,10","–","–"]
["V;III;do 38/0,10","V;III;do 38","V",{"$f":"D524","v":"III"},"do 38","0,10","–","–"]
["V;IV;do 10/0,10","V;IV;do 10","V","IV","do 10","0,10","–","–"]
["V;IV;do 15/0,10","V;IV;do 15","V",{"$f":"D526","v":"IV"},"do 15","0,10","–","–"]
["V;IV;do 25/0,10","V;IV;do 25","V",{"$f":"D527","v":"IV"},"do 25","0,10","–","–"]
["V;IV;do 38/0,10","V;IV;do 38","V",{"$f":"D528","v":"IV"},"do 38","0,10","–","–"]
["V;I;do 10/0,12","V;I;do 10","V","I","do 10","0,12","–","–"]
["V;I;do 15/0,12","V;I;do 15","V",{"$f":"D530","v":"I"},"do 15",{"$f":"F530","v":"0,12"},"–","–"]
["V;I;do 25/0,12","V;I;do 25","V",{"$f":"D531","v":"I"},"do 25","0,12","–","–"]
["V;I;do 38/0,12","V;I;do 38","V",{"$f":"D532","v":"I"},"do 38","0,12","–","–"]
["V;II;do 10/0,12","V;II;do 10","V","II","do 10","0,12","–","–"]
["V;II;do 15/0,12","V;II;do 15","V",{"$f":"D534","v":"II"},"do 15","0,12","–","–"]
["V;II;do 25/0,12","V;II;do 25","V",{"$f":"D535","v":"II"},"do 25","0,12","–","–"]
["V;II;do 38/0,12","V;II;do 38","V",{"$f":"D536","v":"II"},"do 38","0,12","–","–"]
["V;III;do 10/0,12","V;III;do 10","V","III","do 10","0,12","–","–"]
["V;III;do 15/0,12","V;III;do 15","V",{"$f":"D538","v":"III"},"do 15","0,12","–","–"]
["V;III;do 25/0,12","V;III;do 25","V",{"$f":"D539","v":"III"},"do 25","0,12","–","–"]
["V;III;do 38/0,12","V;III;do 38","V",{"$f":"D540","v":"III"},"do 38","0,12","–","–"]
["V;IV;do 10/0,12","V;IV;do 10","V","IV","do 10","0,12","–","–"]
["V;IV;do 15/0,12","V;IV;do 15","V",{"$f":"D542","v":"IV"},"do 15","0,12","–","–"]
["V;IV;do 25/0,12","V;IV;do 25","V",{"$f":"D543","v":"IV"},"do 25","0,12","–","–"]
["V;IV;do 38/0,12","V;IV;do 38","V",{"$f":"D544","v":"IV"},"do 38","0,12","–","–"]
["V;I;do 10/0,15","V;I;do 10","V","I","do 10","0,15","–","–"]
["V;I;do 15/0,15","V;I;do 15","V",{"$f":"D546","v":"I"},"do 15",{"$f":"F546","v":"0,15"},"–","–"]
["V;I;do 25/0,15","V;I;do 25","V",{"$f":"D547","v":"I"},"do 25","0,15","–","–"]
["V;I;do 38/0,15","V;I;do 38","V",{"$f":"D548","v":"I"},"do 38","0,15","–","–"]
["V;II;do 10/0,15","V;II;do 10","V","II","do 10","0,15","–","–"]
["V;II;do 15/0,15","V;II;do 15","V",{"$f":"D550","v":"II"},"do 15","0,15","–","–"]
["V;II;do 25/0,15","V;II;do 25","V",{"$f":"D551","v":"II"},"do 25","0,15","–","–"]
["V;II;do 38/0,15","V;II;do 38","V",{"$f":"D552","v":"II"},"do 38","0,15","–","–"]
["V;III;do 10/0,15","V;III;do 10","V","III","do 10","0,15","–","–"]
["V;III;do 15/0,15","V;III;do 15","V",{"$f":"D554","v":"III"},"do 15","0,15","–","–"]
["V;III;do 25/0,15","V;III;do 25","V",{"$f":"D555","v":"III"},"do 25","0,15","–","–"]
["V;III;do 38/0,15","V;III;do 38","V",{"$f":"D556","v":"III"},"do 38","0,15","–","–"]
["V;IV;do 10/0,15","V;IV;do 10","V","IV","do 10","0,15","–","–"]
["V;IV;do 15/0,15","V;IV;do 15","V",{"$f":"D558","v":"IV"},"do 15","0,15","–","–"]
["V;IV;do 25/0,15","V;IV;do 25","V",{"$f":"D559","v":"IV"},"do 25","0,15","–","–"]
["V;IV;do 38/0,15","V;IV;do 38","V",{"$f":"D560","v":"IV"},"do 38","0,15","–","–"]
["V;I;do 10/0,20","V;I;do 10","V","I","do 10","0,20","–","–"]
["V;I;do 15/0,20","V;I;do 15","V",{"$f":"D562","v":"I"},"do 15",{"$f":"F562","v":"0,20"},"–","–"]
["V;I;do 25/0,20","V;I;do 25","V",{"$f":"D563","v":"I"},"do 25","0,20","–","–"]
["V;I;do 38/0,20","V;I;do 38","V",{"$f":"D564","v":"I"},"do 38","0,20","–","–"]
["V;II;do 10/0,20","V;II;do 10","V","II","do 10","0,20","–","–"]
["V;II;do 15/0,20","V;II;do 15","V",{"$f":"D566","v":"II"},"do 15","0,20","–","–"]
["V;II;do 25/0,20","V;II;do 25","V",{"$f":"D567","v":"II"},"do 25","0,20","–","–"]
["V;II;do 38/0,20","V;II;do 38","V",{"$f":"D568","v":"II"},"do 38","0,20","–","–"]
["V;III;do 10/0,20","V;III;do 10","V","III","do 10","0,20","–","–"]
["V;III;do 15/0,20","V;III;do 15","V",{"$f":"D570","v":"III"},"do 15","0,20","–","–"]
["V;III;do 25/0,20","V;III;do 25","V",{"$f":"D571","v":"III"},"do 25","0,20","–","–"]
["V;III;do 38/0,20","V;III;do 38","V",{"$f":"D572","v":"III"},"do 38","0,20","–","–"]
["V;IV;do 10/0,20","V;IV;do 10","V","IV","do 10","0,20","–","–"]
["V;IV;do 15/0,20","V;IV;do 15","V",{"$f":"D574","v":"IV"},"do 15","0,20","–","–"]
["V;IV;do 25/0,20","V;IV;do 25","V",{"$f":"D575","v":"IV"},"do 25","0,20","–","–"]
["V;IV;do 38/0,20","V;IV;do 38","V",{"$f":"D576","v":"IV"},"do 38","0,20","–","–"]
[{"$f":"B578&\"/\"&F578","v":"V;I;do 10/0,25"},{"$f":"C578&\";\"&D578&\";\"&E578","v":"V;I;do 10"},"V","I","do 10","0,25","–","–"]
["V;I;do 15/0,25","V;I;do 15","V",{"$f":"D578","v":"I"},"do 15",{"$f":"F578","v":"0,25"},"–","–"]
["V;I;do 25/0,25","V;I;do 25","V",{"$f":"D579","v":"I"},"do 25","0,25","–","–"]
["V;I;do 38/0,25","V;I;do 38","V",{"$f":"D580","v":"I"},"do 38","0,25","–","–"]
["V;II;do 10/0,25","V;II;do 10","V","II","do 10","0,25","–","–"]
["V;II;do 15/0,25","V;II;do 15","V",{"$f":"D582","v":"II"},"do 15","0,25","–","–"]
["V;II;do 25/0,25","V;II;do 25","V",{"$f":"D583","v":"II"},"do 25","0,25","–","–"]
["V;II;do 38/0,25","V;II;do 38","V",{"$f":"D584","v":"II"},"do 38","0,25","–","–"]
["V;III;do 10/0,25","V;III;do 10","V","III","do 10","0,25","–","–"]
["V;III;do 15/0,25","V;III;do 15","V",{"$f":"D586","v":"III"},"do 15","0,25","–","–"]
["V;III;do 25/0,25","V;III;do 25","V",{"$f":"D587","v":"III"},"do 25","0,25","–","–"]
["V;III;do 38/0,25","V;III;do 38","V",{"$f":"D588","v":"III"},"do 38","0,25","–","–"]
["V;IV;do 10/0,25","V;IV;do 10","V","IV","do 10","0,25","–","–"]
["V;IV;do 15/0,25","V;IV;do 15","V",{"$f":"D590","v":"IV"},"do 15","0,25","–","–"]
["V;IV;do 25/0,25","V;IV;do 25","V",{"$f":"D591","v":"IV"},"do 25","0,25","–","–"]
["V;IV;do 38/0,25","V;IV;do 38","V",{"$f":"D592","v":"IV"},"do 38","0,25","–","–"]
["V;I;do 10/0,30","V;I;do 10","V","I","do 10","0,30","–","–"]
["V;I;do 15/0,30","V;I;do 15","V",{"$f":"D594","v":"I"},"do 15",{"$f":"F594","v":"0,30"},"–","–"]
["V;I;do 25/0,30","V;I;do 25","V",{"$f":"D595","v":"I"},"do 25","0,30","–","–"]
["V;I;do 38/0,30","V;I;do 38","V",{"$f":"D596","v":"I"},"do 38","0,30","–","–"]
["V;II;do 10/0,30","V;II;do 10","V","II","do 10","0,30","–","–"]
["V;II;do 15/0,30","V;II;do 15","V",{"$f":"D598","v":"II"},"do 15","0,30","–","–"]
["V;II;do 25/0,30","V;II;do 25","V",{"$f":"D599","v":"II"},"do 25","0,30","–","–"]
["V;II;do 38/0,30","V;II;do 38","V",{"$f":"D600","v":"II"},"do 38","0,30","–","–"]
["V;III;do 10/0,30","V;III;do 10","V","III","do 10","0,30","–","–"]
["V;III;do 15/0,30","V;III;do 15","V",{"$f":"D602","v":"III"},"do 15","0,30","–","–"]
["V;III;do 25/0,30","V;III;do 25","V",{"$f":"D603","v":"III"},"do 25","0,30","–","–"]
["V;III;do 38/0,30","V;III;do 38","V",{"$f":"D604","v":"III"},"do 38","0,30","–","–"]
["V;IV;do 10/0,30","V;IV;do 10","V","IV","do 10","0,30","–","–"]
["V;IV;do 15/0,30","V;IV;do 15","V",{"$f":"D606","v":"IV"},"do 15","0,30","–","–"]
["V;IV;do 25/0,30","V;IV;do 25","V",{"$f":"D607","v":"IV"},"do 25","0,30","–","–"]
["V;IV;do 38/0,30","V;IV;do 38","V",{"$f":"D608","v":"IV"},"do 38","0,30","–","–"]
["V;I;do 10/0,40","V;I;do 10","V","I","do 10","0,40","–","–"]
["V;I;do 15/0,40","V;I;do 15","V",{"$f":"D610","v":"I"},"do 15",{"$f":"F610","v":"0,40"},"–","–"]
["V;I;do 25/0,40","V;I;do 25","V",{"$f":"D611","v":"I"},"do 25","0,40","–","–"]
["V;I;do 38/0,40","V;I;do 38","V",{"$f":"D612","v":"I"},"do 38","0,40","–","–"]
["V;II;do 10/0,40","V;II;do 10","V","II","do 10","0,40","–","–"]
["V;II;do 15/0,40","V;II;do 15","V",{"$f":"D614","v":"II"},"do 15","0,40","–","–"]
["V;II;do 25/0,40","V;II;do 25","V",{"$f":"D615","v":"II"},"do 25","0,40","–","–"]
["V;II;do 38/0,40","V;II;do 38","V",{"$f":"D616","v":"II"},"do 38","0,40","–","–"]
["V;III;do 10/0,40","V;III;do 10","V","III","do 10","0,40","–","–"]
["V;III;do 15/0,40","V;III;do 15","V",{"$f":"D618","v":"III"},"do 15","0,40","–","–"]
["V;III;do 25/0,40","V;III;do 25","V",{"$f":"D619","v":"III"},"do 25","0,40","–","–"]
["V;III;do 38/0,40","V;III;do 38","V",{"$f":"D620","v":"III"},"do 38","0,40","–","–"]
["V;IV;do 10/0,40","V;IV;do 10","V","IV","do 10","0,40","–","–"]
["V;IV;do 15/0,40","V;IV;do 15","V",{"$f":"D622","v":"IV"},"do 15","0,40","–","–"]
["V;IV;do 25/0,40","V;IV;do 25","V",{"$f":"D623","v":"IV"},"do 25","0,40","–","–"]
["V;IV;do 38/0,40","V;IV;do 38","V",{"$f":"D624","v":"IV"},"do 38","0,40","–","–"]
["V;I;do 10/0,50","V;I;do 10","V","I","do 10","0,50","–","–"]
["V;I;do 15/0,50","V;I;do 15","V",{"$f":"D626","v":"I"},"do 15",{"$f":"F626","v":"0,50"},"–","–"]
["V;I;do 25/0,50","V;I;do 25","V",{"$f":"D627","v":"I"},"do 25","0,50","–","–"]
["V;I;do 38/0,50","V;I;do 38","V",{"$f":"D628","v":"I"},"do 38","0,50","–","–"]
["V;II;do 10/0,50","V;II;do 10","V","II","do 10","0,50","–","–"]
["V;II;do 15/0,50","V;II;do 15","V",{"$f":"D630","v":"II"},"do 15","0,50","–","–"]
["V;II;do 25/0,50","V;II;do 25","V",{"$f":"D631","v":"II"},"do 25","0,50","–","–"]
["V;II;do 38/0,50","V;II;do 38","V",{"$f":"D632","v":"II"},"do 38","0,50","–","–"]
["V;III;do 10/0,50","V;III;do 10","V","III","do 10","0,50","–","–"]
["V;III;do 15/0,50","V;III;do 15","V",{"$f":"D634","v":"III"},"do 15","0,50","–","–"]
["V;III;do 25/0,50","V;III;do 25","V",{"$f":"D635","v":"III"},"do 25","0,50","–","–"]
["V;III;do 38/0,50","V;III;do 38","V",{"$f":"D636","v":"III"},"do 38","0,50","–","–"]
["V;IV;do 10/0,50","V;IV;do 10","V","IV","do 10","0,50","–","–"]
["V;IV;do 15/0,50","V;IV;do 15","V",{"$f":"D638","v":"IV"},"do 15","0,50","–","–"]
["V;IV;do 25/0,50","V;IV;do 25","V",{"$f":"D639","v":"IV"},"do 25","0,50","–","–"]
["V;IV;do 38/0,50","V;IV;do 38","V",{"$f":"D640","v":"IV"},"do 38","0,50","–","–"]

{"sheet":"param","index":10,"n_rows":79,"n_cols":25,"rows_kept":79,"cut":false,"hidden":true,"merged":[[2,24,3,25],[78,9,78,19],[3,15,3,18],[3,19,3,20],[75,9,75,19],[74,9,74,19],[77,9,77,19],[76,9,76,20]]}
["n","Podkladní materiál","Kat.","a","b",null,"n","Izolant","gMb","Rpanel,sm","Rjoint,sm","Rd,hm","Třída",null,"Třída","0,10","0,12","0,15","0,20","0,25","0,30","0,40","0,50",null,"SKRYTÉ VOLBY:"]
[1,"beton prostý nebo vyztužený třídy C 12/15 až 50/60","A",1.5,2.1,null,1,"minerální vlna FRONTROCK MAX E",1.5,0.25,0.18,{"$f":"kotvení*J2/I2","v":0.11333333333333334},{"$f":"INDEX($P$1:$W$1,1,MATCH(L2,$P$2:$W$2))","v":"0,10"},"MW","Rd,hm >",0.1,0.115,0.14000000000000001,0.19,0.24,0.28999999999999998,0.39,0.49]
[2,"plné cihly nebo kámen","B",2.1,2.9,null,2,"minerální vlna Nobasil FKD S",1.5,0.25,0.18,0.11333333333333334,"0,10","MW","Rd,hm ≤ ",0.115,0.14000000000000001,0.19,0.24,0.28999999999999998,0.39,0.49,"–",null,"ZPŮSOB KOTVENÍ"]
[3,"duté nebo děrované cihly nebo tvárnice","C",1.8,2.5,null,3,"minerální vlna Isover TF profi",1.5,0.25,0.18,0.11333333333333334,"0,10","MW","Min.tuhost","0,30",null,null,null,"0,40",null,"0,50","0,70"]
[4,"beton z pórovitého kameniva třídy LAC 2 až 25","D",2.4,3.2,null,4,"minerální vlna FASROCK",1.2,0.25,0.18,0.14166666666666669,"0,15","MW","talířku c"]
[5,"autoklávový pórobeton třídy P 2 až 7","E",1.8,2.5,null,5,"pěnový polystyrén 70F",1.2,0.25,0.18,0.14166666666666669,"0,15","EPS"]
[6,"betonová vrstva sendvičových panelů min. 50 mm","–",1.6,2.2999999999999998,null,6,"minerální vlna Nobasil FKD N",1.5,0.25,0.18,0.11333333333333334,"0,10","MW"]
[7,"deskové materiály","–",1.8,2.5,null,7,"minerální vlna Isover TF hobby",1.5,0.25,0.18,0.11333333333333334,"0,10","MW"]
[null,null,null,null,null,null,8,"fenolická pěna",2.2000000000000002,0.38,0.28000000000000003,0.11745454545454545,"0,12","PF",null,null,null,null,null,null,null,null,null,null,"verze:"]
[8,"jiný podkladní materiál","–",2.4,3.2,null,null,null,null,null,null,null,null,null,null,null,null,null,null,null,null,null,null,null,"3.05"]
[null,null,null,null,null,null,null,null,null,null,null,null,null,null,null,null,null,null,null,null,null,null,null,null,"ROCKWOOL"]
[null,null,null,null,null,null,"x","izolant","montáž","hmoždinka","talířek","Rpanel","Rd,hm","Třída"]
[null,null,null,null,null,null,{"$f":"H13&I13&J13&IF(K13>0,\"A\",\"N\")","v":"minerální vlna FRONTROCK MAX EpovrchováPTH-EXA"},"minerální vlna FRONTROCK MAX E","povrchová","PTH-EX",100,0.67,{"$f":"0.68*L13/VLOOKUP(H13,$H$1:$M$9,2,)","v":0.30373333333333336},{"$f":"INDEX($P$1:$W$1,1,MATCH(M13,$P$2:$W$2))","v":"0,30"},"Bravoll"]
[null,null,null,null,null,null,"minerální vlna FRONTROCK MAX EpovrchováPTH-EXN","minerální vlna FRONTROCK MAX E","povrchová","PTH-EX",0,0.41,0.18586666666666665,"0,15","Bravoll"]
[null,null,null,null,null,null,"minerální vlna FRONTROCK MAX EpovrchováPTH-KZA","minerální vlna FRONTROCK MAX E","povrchová","PTH-KZ",100,0.67,0.30373333333333336,"0,30","Bravoll"]
["n","Podkladní materiál","Kat.","a","b",null,"minerální vlna FRONTROCK MAX EpovrchováPTH-KZN","minerální vlna FRONTROCK MAX E","povrchová","PTH-KZ",0,0.41,0.18586666666666665,"0,15","Bravoll"]
[1,"(A) beton","A",1.5,2.1,null,"minerální vlna FRONTROCK MAX EpovrchováPTH-SA","minerální vlna FRONTROCK MAX E","povrchová","PTH-S",100,0.67,0.30373333333333336,"0,30","Bravoll"]
[2,"(B) plná pálená cihla","B",2.1,2.9,null,"minerální vlna FRONTROCK MAX EpovrchováPTH-SN","minerální vlna FRONTROCK MAX E","povrchová","PTH-S",0,0.41,0.18586666666666665,"0,15","Bravoll"]
[3,"(B) plná tvárnice z lehčeného betonu","B",2.1,2.9,null,"minerální vlna FRONTROCK MAX EpovrchováH1 ecoA","minerální vlna FRONTROCK MAX E","povrchová","H1 eco",90,0.57999999999999996,0.26293333333333335,"0,25","Ejot"]
[4,"(B) vápenopísková cihla","B",2.1,2.9,null,"minerální vlna FRONTROCK MAX EpovrchováH1 ecoN","minerální vlna FRONTROCK MAX E","povrchová","H1 eco",0,0.49,0.22213333333333332,"0,20","Ejot"]
[5,"(C) děrovaná cihla","C",1.8,2.5,null,"minerální vlna FRONTROCK MAX EpovrchováSTR U 2GA","minerální vlna FRONTROCK MAX E","povrchová","STR U 2G",90,0.57999999999999996,0.26293333333333335,"0,25","Ejot"]
[6,"(C) děrovaná/dutinová tvárnice","C",1.8,2.5,null,"minerální vlna FRONTROCK MAX EpovrchováSTR U 2GN","minerální vlna FRONTROCK MAX E","povrchová","STR U 2G",0,0.49,0.22213333333333332,"0,20","Ejot"]
[7,"(D) dutá tvárnice z lehčeného betonu","D",2.4,3.2,null,"minerální vlna FRONTROCK MAX Epovrchovátermoz CN 8N","minerální vlna FRONTROCK MAX E","povrchová","termoz CN 8",0,0.51400000000000001,0.23301333333333338,"0,20","Fischer"]
[8,"(D) lehčený beton s pórovitým kamenivem","D",2.4,3.2,null,"minerální vlna FRONTROCK MAX Epovrchovátermofix CF 8A","minerální vlna FRONTROCK MAX E","povrchová","termofix CF 8",110,0.76,0.34453333333333336,"0,30","fischer"]
[9,"(D) mezerovitý lehčený beton","D",2.4,3.2,null,"minerální vlna FRONTROCK MAX Epovrchovátermofix CF 8N","minerální vlna FRONTROCK MAX E","povrchová","termofix CF 8",0,0.51400000000000001,0.23301333333333338,"0,20","fischer"]
[10,"(E) pórobeton","E",1.8,2.5,null,"minerální vlna FRONTROCK MAX Epovrchovátermoz 8 UA","minerální vlna FRONTROCK MAX E","povrchová","termoz 8 U",110,0.76,0.34453333333333336,"0,30","fischer"]
[null,null,null,null,null,null,"minerální vlna FRONTROCK MAX Epovrchovátermoz 8 UN","minerální vlna FRONTROCK MAX E","povrchová","termoz 8 U",0,0.51400000000000001,0.23301333333333338,"0,20","fischer"]
[null,"Výrobce","Talířek",null,null,null,"minerální vlna FRONTROCK MAX Epovrchovátermoz CN 8A","minerální vlna FRONTROCK MAX E","povrchová","termoz CN 8",110,0.76,0.34453333333333336,"0,30","fischer"]
[null,"Ejot;povrchová","VT90",null,null,null,"minerální vlna FRONTROCK MAX Epovrchovátermoz CS 8A","minerální vlna FRONTROCK MAX E","povrchová","termoz CS 8",110,0.76,0.34453333333333336,"0,30","fischer"]
[null,"Ejot;zápustná","VT2G",null,null,null,"minerální vlna FRONTROCK MAX Epovrchovátermoz CS 8N","minerální vlna FRONTROCK MAX E","povrchová","termoz CS 8",0,0.51400000000000001,0.23301333333333338,"0,20","fischer"]
[null,"Bravoll;povrchová","IT PTH 100",null,null,null,"minerální vlna FRONTROCK MAX EpovrchováHTS-PA","minerální vlna FRONTROCK MAX E","povrchová","HTS-P",90,0.41,0.18586666666666665,"0,15","Hilti"]
[null,"Bravoll;zápustná","ZT 100",null,null,null,"minerální vlna FRONTROCK MAX EpovrchováHTS-PN","minerální vlna FRONTROCK MAX E","povrchová","HTS-P",0,0.36,0.16320000000000001,"0,15","Hilti"]
[null,"Fischer;povrchová","DT 110V",null,null,null,"minerální vlna FRONTROCK MAX EpovrchováSD-5A","minerální vlna FRONTROCK MAX E","povrchová","SD-5",90,0.41,0.18586666666666665,"0,15","Hilti"]
[null,"Fischer;zápustná","DT 110V",null,null,null,"minerální vlna FRONTROCK MAX EpovrchováSD-5N","minerální vlna FRONTROCK MAX E","povrchová","SD-5",0,0.36,0.16320000000000001,"0,15","Hilti"]
[null,"Wkret-met;povrchová","–",null,null,null,"minerální vlna FRONTROCK MAX EpovrchováSDX-8A","minerální vlna FRONTROCK MAX E","povrchová","SDX-8",90,0.41,0.18586666666666665,"0,15","Hilti"]
[null,"Wkret-met;zápustná","integrovaný rozšiřovací talíř v hmoždince",null,null,null,"minerální vlna FRONTROCK MAX EpovrchováSDX-8N","minerální vlna FRONTROCK MAX E","povrchová","SDX-8",0,0.36,0.16320000000000001,"0,15","Hilti"]
[null,"Hilti;povrchová","HDT-FV 90",null,null,null,"minerální vlna FRONTROCK MAX EpovrchováXI-FVA","minerální vlna FRONTROCK MAX E","povrchová","XI-FV",90,0.41,0.18586666666666665,"0,15","Hilti"]
[null,"Koelner;povrchová","–",null,null,null,"minerální vlna FRONTROCK MAX EpovrchováXI-FVN","minerální vlna FRONTROCK MAX E","povrchová","XI-FV",0,0.36,0.16320000000000001,"0,15","Hilti"]
[null,"Koelner;zápustná","–",null,null,null,"minerální vlna FRONTROCK MAX EpovrchováTSBD 8N","minerální vlna FRONTROCK MAX E","povrchová","TSBD 8",0,0.34,0.15413333333333337,"0,15","Kew"]
[null,null,null,null,null,null,"minerální vlna FRONTROCK MAX EpovrchováTSBDL 8N","minerální vlna FRONTROCK MAX E","povrchová","TSBDL 8",0,0.34,0.15413333333333337,"0,15","Kew"]
[null,"+2 výjimky",null,null,null,null,"minerální vlna FRONTROCK MAX EpovrchováTFIX-8MN","minerální vlna FRONTROCK MAX E","povrchová","TFIX-8M",0,0.42,0.19040000000000001,"0,20","Koelner"]
[null,"eco-drive W bez -> integrovaný rozšiřovací talíř",null,null,null,null,"minerální vlna FRONTROCK MAX EpovrchováTFIX-8SN","minerální vlna FRONTROCK MAX E","povrchová","TFIX-8S",0,0.45,0.20400000000000004,"0,20","Koelner"]
[null,"Bravoll zápustná bez -> zápustný přípravek ZP",null,null,null,null,"minerální vlna FRONTROCK MAX EpovrchováFIXPLUG 8N","minerální vlna FRONTROCK MAX E","povrchová","FIXPLUG 8",0,0.64,0.29013333333333335,"0,30","Wkret-met"]
[null,"(ošetřeno vzorcem v buňce \"netalíř\")",null,null,null,null,"minerální vlna FRONTROCK MAX EpovrchováWKTHERM 8N","minerální vlna FRONTROCK MAX E","povrchová","WKTHERM 8",0,0.64,0.29013333333333335,"0,30","Wkret-met"]
[null,null,null,null,null,null,{"$f":"H45&I45&J45&IF(K45>0,\"A\",\"N\")","v":"minerální vlna FRONTROCK MAX EpovrchováWKTHERM 8SN"},"minerální vlna FRONTROCK MAX E","povrchová","WKTHERM 8S",0,0.64,{"$f":"0.68*L45/VLOOKUP(H45,$H$1:$M$9,2,)","v":0.29013333333333335},{"$f":"INDEX($P$1:$W$1,1,MATCH(M45,$P$2:$W$2))","v":"0,30"},"Wkret-met"]
[null,null,null,null,null,null,"minerální vlna FRONTROCK MAX EzápustnáPTH-SA","minerální vlna FRONTROCK MAX E","zápustná","PTH-S",100,0.72,0.32640000000000002,"0,30","Bravoll"]
[null,null,null,null,null,null,"minerální vlna FRONTROCK MAX EzápustnáPTH-SN","minerální vlna FRONTROCK MAX E","zápustná","PTH-S",0,0.31,0.14053333333333334,"0,15","Bravoll"]
[null,null,null,null,null,null,"minerální vlna FRONTROCK MAX EzápustnáSTR U 2GA","minerální vlna FRONTROCK MAX E","zápustná","STR U 2G",110,0.84,0.38080000000000003,"0,30","Ejot"]
[null,null,null,null,null,null,"minerální vlna FRONTROCK MAX Ezápustnátermoz CS 8A","minerální vlna FRONTROCK MAX E","zápustná","termoz CS 8",110,0.76,0.34453333333333336,"0,30","fischer"]
[null,null,null,null,null,null,"minerální vlna FRONTROCK MAX Ezápustnátermoz CS 8N","minerální vlna FRONTROCK MAX E","zápustná","termoz CS 8",0,0.51400000000000001,0.23301333333333338,"0,20","fischer"]
[null,null,null,null,null,null,"minerální vlna FRONTROCK MAX EzápustnáHelix D 8-FVN","minerální vlna FRONTROCK MAX E","zápustná","Helix D 8-FV",0,0.23,0.10426666666666667,"0,10","Hilti"]
[null,null,null,null,null,null,"minerální vlna FRONTROCK MAX Ezápustnáeco-drive WA","minerální vlna FRONTROCK MAX E","zápustná","eco-drive W",110,1.29,0.5848000000000001,"0,50","Wkret-met"]
[null,null,null,null,null,null,"minerální vlna FASROCKpovrchováPTH-EXA","minerální vlna FASROCK","povrchová","PTH-EX",100,0.98199999999999998,0.55646666666666667,"0,50","Bravoll"]
[null,null,null,null,null,null,"minerální vlna FASROCKpovrchováPTH-EXN","minerální vlna FASROCK","povrchová","PTH-EX",0,0.57999999999999996,0.32866666666666672,"0,30","Bravoll"]
[null,null,null,null,null,null,"minerální vlna FASROCKpovrchováPTH-KZA","minerální vlna FASROCK","povrchová","PTH-KZ",100,0.98199999999999998,0.55646666666666667,"0,50","Bravoll"]
[null,null,null,null,null,null,"minerální vlna FASROCKpovrchováPTH-KZN","minerální vlna FASROCK","povrchová","PTH-KZ",0,0.57999999999999996,0.32866666666666672,"0,30","Bravoll"]
[null,null,null,null,null,null,"minerální vlna FASROCKpovrchováPTH-SA","minerální vlna FASROCK","povrchová","PTH-S",100,0.98199999999999998,0.55646666666666667,"0,50","Bravoll"]
[null,null,null,null,null,null,"minerální vlna FASROCKpovrchováPTH-SN","minerální vlna FASROCK","povrchová","PTH-S",0,0.57999999999999996,0.32866666666666672,"0,30","Bravoll"]
[null,null,null,null,null,null,"minerální vlna FASROCKpovrchováH1 ecoN","minerální vlna FASROCK","povrchová","H1 eco",0,0.63279999999999992,0.35858666666666666,"0,30","Ejot"]
[null,null,null,null,null,null,"minerální vlna FASROCKpovrchováSTR U 2GN","minerální vlna FASROCK","povrchová","STR U 2G",0,0.63279999999999992,0.35858666666666666,"0,30","Ejot"]
[null,null,null,null,null,null,"minerální vlna FASROCKpovrchovátermofix CF 8N","minerální vlna FASROCK","povrchová","termofix CF 8",0,0.75900000000000001,0.43010000000000004,"0,40","fischer"]
[null,null,null,null,null,null,"minerální vlna FASROCKpovrchovátermoz 8 UN","minerální vlna FASROCK","povrchová","termoz 8 U",0,0.75900000000000001,0.43010000000000004,"0,40","fischer"]
[null,null,null,null,null,null,"minerální vlna FASROCKpovrchovátermoz CN 8N","minerální vlna FASROCK","povrchová","termoz CN 8",0,0.75900000000000001,0.43010000000000004,"0,40","fischer"]
[null,null,null,null,null,null,"minerální vlna FASROCKpovrchovátermoz CS 8N","minerální vlna FASROCK","povrchová","termoz CS 8",0,0.75900000000000001,0.43010000000000004,"0,40","fischer"]
[null,null,null,null,null,null,"minerální vlna FASROCKpovrchováTFIX-8MN","minerální vlna FASROCK","povrchová","TFIX-8M",0,0.64700000000000002,0.36663333333333337,"0,30","Koelner"]
[null,null,null,null,null,null,"minerální vlna FASROCKzápustnáPTH-SA","minerální vlna FASROCK","zápustná","PTH-S",100,0.98199999999999998,0.55646666666666667,"0,50","Bravoll"]
[null,null,null,null,null,null,"minerální vlna FASROCKzápustnáPTH-SN","minerální vlna FASROCK","zápustná","PTH-S",0,0.57999999999999996,0.32866666666666672,"0,30","Bravoll"]
[null,null,null,null,null,null,"minerální vlna FASROCKzápustnáSTR U 2GN","minerální vlna FASROCK","zápustná","STR U 2G",0,0.55510000000000004,0.31455666666666671,"0,30","Ejot"]
[null,null,null,null,null,null,"minerální vlna FASROCKzápustnátermoz CS 8N","minerální vlna FASROCK","zápustná","termoz CS 8",0,0.75900000000000001,0.43010000000000004,"0,40","fischer"]
[]
[]
[null,null,null,null,null,null,null,"Rd,hm","=","0,68 × Rpanel / gMb",null,null,null,"(4)"]
[null,null,null,null,null,null,null,"Rd,hm","=","NRk / gMc",null,null,null,"(5)"]
[]
[null,null,null,null,null,null,null,"Rd,hm","...","návrhová odolnost hmoždinky vůči účinkům sání větru"]
[null,null,null,null,null,null,null,"Rpanel","...","průměrná hodnota odolnosti proti protažení na 1 hmoždinku\n(stanoveno pro daný izolant)"]
[null,null,null,null,null,null,null,"gMb","...","součinitel bezpečnosti upevnění při spolupůsobení hmoždinky s deskami tepelné izolace\n(uveden výrobcem izolace)"]
[null,null,null,null,null,null,null,"NRk","...","charakteristická hodnota únosnosti zvoleného typu hmoždinky\n(uvedená výrobcem hmoždinky)"]
[null,null,null,null,null,null,null,"gMc","...","součinitel bezpečnosti upevnění při montáži hmoždinky\n(stanoveno pro daný podkladový materiál a způsob montáže)"]