{"text_format":"1","workbook":"xlsx","n_sheets":11,"sheets":["0a","0b","1","2","3","4","větrnéoblasti","db","rozmístěníhmoždinek","počtyhmoždinek","param"],"not_rendered":{"charts":0,"images":25,"macros":1,"external_links":0,"defined_names":98,"comments":5,"pivot_tables":0},"unopened":[],"bounds":{"document_bytes":16777216,"sheet_cells":100000,"rows_first":2000,"rows_last":500,"rows_between":2000,"halvings":0,"cell_chars":16384,"cell_head_chars":4096},"cells_cut":0,"cells_raw":0,"read":"whole","date_system":"1900"}

{"sheet":"0a","index":0,"n_rows":22,"n_cols":21,"rows_kept":22,"cut":false,"hidden":false,"merged":[[2,9,2,15]]}
[]
[]
[null,null,null,null,null,null,null,null,null,"Cech pro zateplování budov ČR, z.s.\nZelený pruh 1294/50, 147 08 Praha 4\nwww.czb.cz, czb@czb.cz"]
[]
[null,null,null,null,null,null,null," KALKULÁTOR PRO STANOVENÍ POČTU HMOŽDINEK"]
[null,null,null,null,null,null,null,"V ETICS POMOCÍ ZJEDNODUŠENÉHO NÁVRHU"]
[null,null,null,null,null,null,null,"dle článku 5.4.3 ČSN 73 2902 Vnější tepelně izolační kompozitní systémy (ETICS)"]
[null,null,null,null,null,null,null,"Firemní verze společnosti ROCKWOOL, a.s."]
[]
[]
[]
[]
[]
[]
[]
[]
[]
[null,null,null,null,null,null,null,"  Technické poradenství: 800 161 161, info@rockwool.cz "]
[]
[]
{"$rows_left_out":3}
{"sheet":"0b","index":1,"n_rows":28,"n_cols":21,"rows_kept":28,"cut":false,"hidden":false,"merged":[]}
[null,null,null,null,"KALKULÁTOR PRO STANOVENÍ POČTU HMOŽDINEK V ETICS"]
[]
[null,null,"Pomocí tohoto kalkulátoru lze stanovit počty hmoždinek pro kotvení desek FRONTROCK MAX E a FASROCK v systémech ETICS mechanicky"]
[null,null,"kotvených s doplňkovým lepením. Výpočet probíhá pomocí zjednodušeného návrhu dle článku 5.4.3 ČSN 73 2902, na základě zvolených"]
[null,null,"charakteristik objektu (výška, větrová oblast, kategorie terénu, podkladní materiál), zvoleného tepelněizolačního materiálu a hmoždinky."]
[]
[null,null,"Zjednodušený výpočet pomocí tohoto kalkulátoru lze provést výhradně pro hmoždinky, jejichž shoda byla prokázána podle Řídících pokynů"]
[null,null,"ETAG 014 a jsou součástí ETICS podle dokumentace výrobce ETICS, který prokázal shodu systému postupem podle Řídících pokynů ETAG 004."]
[null,null,"a tepelněizolačním deskám. Kalkulátor je určen pro výpočet kotvení tepelněizolačních desek o tloušťkách ≥ 100 mm."]
[null,null,"Za využití hodnot z tohoto kalkulátoru je plně odpovědná osoba, která ho používá."]
[]
[null,null,"Kalkulátor obsahuje databázi hmoždinek od jednotlivých výrobců, členů Cechu pro zateplování budov, jehož členem je i ROCKWOOL, a.s."]
[null,null,"Všechny hmoždinky použité v tomto kalkulátoru splňují kritéria kvalitativní třídy A CZB."]
[]
[null,null,"Výpočet probíhá formou průvodce - v prvním kroku se zadají charakteristiky objektu, ve druhém kroku se z nabídky všech hmoždinek"]
[null,null,"vhodných pro daný typ podkladu zvolí jedna hmoždinka a upřesní se podkladní materiál a ve třetím kroku se zobrazí vypočítané výsledky,"]
[null,null,"tj. vhodnost zvolené hmoždinky, počty hmoždinek pro okrajové a vnitřní oblasti fasády a také schéma doporučeného rozmístění hmoždinek."]
[]
[null,null,"Hodnoty protažení hmoždinek deskou z MW TR 10 jsou redukovány dle vzorce: R' = R - (1 - TRd/TRm) × 0,4 × R, používaného TZUS."]
[null,null,"Redukcí je zajištěno, aby nebyly hodnoty odolnosti protažení nadhodnoceny provedením zkoušky na tepelněizolačním výrobku výrazně"]
{"$rows_left_out":9}
{"sheet":"1","index":2,"n_rows":31,"n_cols":21,"rows_kept":31,"cut":false,"hidden":false,"merged":[[30,2,30,19],[2,12,3,19],[2,6,3,9],[11,2,12,10],[2,2,3,4],[2,10,3,10],[4,10,5,10],[20,2,21,10],[13,2,14,10],[15,2,17,10],[18,2,19,10],[12,12,13,19],[18,12,19,19],[27,2,27,19],[28,2,28,19],[29,2,29,19]]}
[null,null,null,null,null,null,"1. OBJEKT"]
[]
[null,null,"VÝŠKA OBJEKTU",null,null,null,"VĚTROVÁ OBLAST",null,null,null,"výběr",null,"PODKLADNÍ MATERIÁL dle ETAG 014"]
[]
[]
[]
[]
[]
[]
[]
[null,null,null,{"$f":"CHOOSE(výška_,\"do 10\",\"do 15\",\"do 25\",\"do 38\")","v":{"$error":"#VALUE!"}},null,null,null,{"$f":"CHOOSE(větrováoblast_,\"I\",\"II\",\"III\",\"IV\")","v":{"$error":"#VALUE!"}}]
[null,null,"KATEGORIE TERÉNU",null,null,null,null,null,null,null,null,null,null,{"$f":"CHOOSE(podklad_,\"A\",\"B\",\"C\",\"D\",\"E\",\"–\")","v":{"$error":"#VALUE!"}}]
[null,null,null,null,null,null,null,null,null,null,null,null,"TEPELNĚIZOLAČNÍ MATERIÁL"]
[]
[]
[]
[]
[]
[null,null,null,null,null,null,null,null,null,null,null,null,"ROZMĚR DESKY"]
[]
{"$rows_left_out":12}
{"sheet":"2","index":3,"n_rows":45,"n_cols":16,"rows_kept":45,"cut":false,"hidden":false,"merged":[[2,2,2,4],[14,2,15,4],[17,10,17,17],[18,10,18,17],[21,2,22,4],[2,10,2,15],[9,10,9,17],[10,10,10,17],[11,10,11,17],[12,10,12,17],[27,2,29,4],[13,10,13,17],[14,10,14,17],[15,10,15,17],[16,10,16,17]]}
[null,null,null,null,null,null,"2. HMOŽDINKY"]
[]
[null,null,"VÝROBCE",null,null,null,"hmoždinka","výrobce","typ",null,"HODNOTA ÚNOSTNOSTI NRk"]
[]
[]
[]
[null,null,null,null,null,null,null,null,null,null,null,"NRk =-",null," kN"]
[]
[null,null,null,null,null,null,null,null,null,null,"specifikace podkladu"]
[]
[]
[]
[]
[null,null,8,{"$f":"CHOOSE(výrobce_,\"Bravoll\",\"Ejot\",\"Fischer\",\"Hilti\",\"Kew\",\"Koelner\",\"Wkret-met\",\"libovolný\")","v":"libovolný"}]
[null,null,"TYP"]
[]
[]
[]
[]
[]
{"$rows_left_out":26}
{"sheet":"3","index":4,"n_rows":85,"n_cols":18,"rows_kept":85,"cut":false,"hidden":false,"merged":[[84,2,84,19],[82,2,82,19],[83,2,83,19],[81,2,81,19],[2,2,3,8],[2,9,3,19],[38,2,39,19],[44,2,45,8],[77,2,77,19],[44,17,45,19],[44,9,45,16],[78,2,78,19]]}
["x",null,null,null,null,null,"3. VÝSLEDKY"]
[]
[null,null,"OBJEKT",null,null,null,null,null,null,"HMOŽDINKY"]
[]
[]
[null,null,{"$f":"\"výška objektu = \"&výška&\" m\"","v":{"$error":"#VALUE!"}},null,null,null,null,null,null,{"$f":"\"hmoždinka = \"&VLOOKUP(myHmoždinka,hmoDB,2,)&\" \"&myHmoždinka","v":{"$error":"#N/A"}}]
[null,null,{"$f":"\"větrová oblast = \"&větrováoblast","v":{"$error":"#VALUE!"}},null,null,null,null,null,null,{"$f":"\"ETA číslo = \"&VLOOKUP(myHmoždinka,hmoDB,6,)","v":{"$error":"#N/A"}}]
[null,null,{"$f":"\"kategorie terénu = \"&terén","v":{"$error":"#VALUE!"}},null,null,null,null,null,null,{"$f":"IF(podklad=\"–\",VLOOKUP(myHmoždinka,hmoDB,11,),\"bodový činitel prostupu tepla = \"&IFERROR(INDEX(db!$R$5:$R$321,MATCH(myHmoždinka&montáž,db!$B$5:$B$321&db!$P$5:$P$321,),1)*1&\" W/K\",VLOOKUP(myHmoždinka,hmoDB,17,)))","v":{"$error":"#VALUE!"}}]
[null,null,{"$f":"\"kategorie podkladu = \"&podklad","v":{"$error":"#VALUE!"}},null,null,null,null,null,null,{"$f":"\"typ = \"&VLOOKUP(myHmoždinka,hmoDB,3,)","v":{"$error":"#N/A"}}]
[null,null,{"$f":"\"izolant = \"&izolant","v":{"$error":"#VALUE!"}},null,null,null,null,null,null,{"$f":"\"montáž hmoždinky = \"&montáž","v":"montáž hmoždinky = povrchová"}]
[{"$f":"IF(AND(VLOOKUP(myHmoždinka,hmoDB,2,)=\"Bravoll\",montáž=\"zápustná\",talířek=\"N\"),\"zápustný přípravek ZP\",\"rozšiřovací talíř hmoždinky nepoužit\")","v":{"$error":"#N/A"}},null,{"$f":"\"šířka desky = \"&LEFT(deska,3)&\" mm\"","v":"šířka desky = 600 mm"},null,null,null,null,null,null,{"$f":"IF(talířek=\"N\",netalíř,\"rozšiřovací talíř hmoždinky = \"&VLOOKUP(VLOOKUP(myHmoždinka,hmoDB,2,)&\";\"&montáž,talířky,2,))","v":{"$error":"#N/A"}}]
[null,null,{"$f":"IF(myRpanel=0,\"\",\"hodnota Rpanel ze zkoušky protažením = \"&myRpanel&\" kN\")","v":""},null,null,null,null,null,null,{"$f":"IF(myNrk_=2,\"hodnota NRk z výtažných zkoušek = \"&myNrk&\" kN\",\"specifikace podkladu = \"&myPodklad)","v":"specifikace podkladu = "}]
[null,null,"VÝPOČTY:"]
[]
[null,null,"Objekt:",null,null,"třída únosnosti",null,null,null,null,"0,10","0,12","0,15","0,20","0,25","0,30","0,40","0,50"]
[null,null,{"$f":"větrováoblast&\";\"&terén&\";\"&výška","v":{"$error":"#VALUE!"}},null,null,{"$f":"\"hmoždinek\"&IF(deska_=2,\"/1,2\",\" na\")&\" m² (okrajové oblasti)\"","v":"hmoždinek/1,2 m² (okrajové oblasti)"},null,null,null,null,{"$f":"VLOOKUP(objekt&\"/\"&K$15,počtyhmoždinek,IF(deska_=2,8,7),)","v":{"$error":"#VALUE!"}},{"$error":"#VALUE!"},{"$error":"#VALUE!"},{"$error":"#VALUE!"},{"$error":"#VALUE!"},{"$error":"#VALUE!"},{"$error":"#VALUE!"},{"$error":"#VALUE!"}]
[null,null,null,null,null,{"$f":"\"hmoždinek\"&IF(deska_=2,\"/1,2\",\" na\")&\" m² (vnitřní oblasti)\"","v":"hmoždinek/1,2 m² (vnitřní oblasti)"},null,null,null,null,{"$f":"IF(K16=\"–\",\"–\",CEILING(MAX(75%*K16,6),2))","v":{"$error":"#VALUE!"}},{"$error":"#VALUE!"},{"$error":"#VALUE!"},{"$error":"#VALUE!"},{"$error":"#VALUE!"},{"$error":"#VALUE!"},{"$error":"#VALUE!"},{"$error":"#VALUE!"}]
[null,null,null,null,null,{"$f":"\"hmoždinek\"&IF(deska_=2,\"/1,2\",\" na\")&\" m² (okraj pro 15 m)\"","v":"hmoždinek/1,2 m² (okraj pro 15 m)"},null,null,null,null,{"$f":"VLOOKUP(větrováoblast&\";\"&terén&\";\"&\"do 15/\"&K$15,počtyhmoždinek,IF(deska_=2,8,7),)","v":{"$error":"#VALUE!"}},{"$error":"#VALUE!"},{"$error":"#VALUE!"},{"$error":"#VALUE!"},{"$error":"#VALUE!"},{"$error":"#VALUE!"},{"$error":"#VALUE!"},{"$error":"#VALUE!"}]
[null,null,null,null,null,{"$f":"\"hmoždinek\"&IF(deska_=2,\"/1,2\",\" na\")&\" m² (vnitřní pro 15 m)\"","v":"hmoždinek/1,2 m² (vnitřní pro 15 m)"},null,null,null,null,{"$f":"IF(K18=\"–\",\"–\",CEILING(MAX(75%*K18,6),2))","v":{"$error":"#VALUE!"}},{"$error":"#VALUE!"},{"$error":"#VALUE!"},{"$error":"#VALUE!"},{"$error":"#VALUE!"},{"$error":"#VALUE!"},{"$error":"#VALUE!"},{"$error":"#VALUE!"}]
[]
{"$rows_left_out":66}
{"sheet":"4","index":5,"n_rows":92,"n_cols":21,"rows_kept":92,"cut":false,"hidden":false,"merged":[[10,2,11,8],[10,9,11,19],[46,2,47,19],[52,2,53,8],[52,9,53,16],[52,17,53,19],[86,2,86,19],[5,14,7,19],[5,2,5,3],[5,4,5,13],[8,2,8,3],[8,9,8,10],[8,11,8,13],[6,2,6,3],[6,4,6,13],[7,2,7,3],[7,4,7,13],[8,4,8,8],[85,2,85,19]]}
[null,null,null,null,null,null,null,"KALKULÁTOR PRO STANOVENÍ POČTU HMOŽDINEK"]
[null,null,null,null,null,null,null," V ETICS POMOCÍ ZJEDNODUŠENÉHO NÁVRHU"]
[null,null,null,null,null,null,null," dle článku 5.4.3 ČSN 73 2902 Vnější tepelně izolační kompozitní systémy (ETICS)"]
[null,null,null,null,null,null,null," Firemní verze společnosti ROCKWOOL, a.s."]
[]
[null,null,"Stavba:",null,"DOPLŇTE NÁZEV"]
[null,null,"Adresa:",null,"DOPLŇTE ADRESU"]
[null,null,"Investor:",null,"DOPLŇTE INVESTORA"]
[null,null,"Zpracoval:",null,"DOPLŇTE ZPRACOVATELE",null,null,null,null,"Datum:",null,"DOPLŇTE DATUM",null,null,"Razítko a podpis autorizované osoby ČKAIT"]
[]
[null,null,"OBJEKT",null,null,null,null,null,null,"HMOŽDINKY"]
[]
[]
[]
[]
[]
[]
[]
[]
[]
{"$rows_left_out":73}
{"sheet":"větrnéoblasti","index":6,"n_rows":75,"n_cols":3,"rows_kept":75,"cut":false,"hidden":false,"merged":[]}
[null,"Místo","Větrová"]
[null,null,"oblast"]
[null,"Benešov","II"]
[null,"Beroun","II"]
[null,"Blansko","II"]
[null,"Břeclav","II"]
[null,"Brno","II"]
[null,"Bruntál","III"]
[null,"Česká Lípa","II"]
[null,"České Budějovice","II"]
[null,"Český Krumlov","II"]
[null,"Děčín","II"]
[null,"Domažlice","II"]
[null,"Frýdek-Místek","II"]
[null,"Havlíčkův Brod","II"]
[null,"Hlinsko","IV"]
[null,"Hodonín","II"]
[null,"Hradec Králové","II"]
[null,"Cheb","I"]
[null,"Chomutov","II"]
{"$rows_left_out":56}
{"sheet":"db","index":7,"n_rows":321,"n_cols":18,"rows_kept":321,"cut":false,"hidden":true,"merged":[]}
[null,"hmoždinka","výrobce","typ","izolant","montáž","podklad","průtah",null,"hmoždinka","podklad","specifikace podkladu"]
[null,"*",{"$f":"IF(výrobce=\"libovolný\",\"*\",výrobce)","v":"*"},{"$f":"IF(typ=\"libovolný\",\"*\",typ)","v":"*"},{"$f":"VLOOKUP(izolant,param!$H$1:$N$9,7,)","v":{"$error":"#VALUE!"}},{"$f":"montáž","v":"povrchová"},{"$f":"podklad","v":{"$error":"#VALUE!"}},"ANO",null,{"$f":"IF(myHmoždinka=\"\",\"ejotherm NT U\",myHmoždinka)","v":"ejotherm NT U"},{"$f":"podklad","v":{"$error":"#VALUE!"}},"*"]
[]
["index","hmoždinka","výrobce","typ","Tuhost talířku c [kN/mm]","Průměr talířku [mm]","ETA číslo","podklad","specifikace podkladu","Min. obj. hmotnost ρ [kg/dm³]","Min.pevnost v tlaku β [N/mm²]","Poznámka","Char. únosnost NRk (kN)","Souč.bezp.mont. gMc","izolant","montáž","průtah","Souč.bod. prostupu tepla (W/K)"]
[{"$f":"B5&\"_\"&I5","v":"termoz 8 U_beton C12/15-C50/60"},"termoz 8 U","fischer","šroubovací",0.5,60,"02/0019","A","beton C12/15-C50/60",null,null,null,1.5,null,"MW","povrchová",{"$f":"IF(ISERROR(VLOOKUP(izolant&montáž&B5&talířek,Rpanely,6,)),\"NE\",\"ANO\")","v":"NE"},2E-3]
["termoz 8 U_plná vápenopísková cihla","termoz 8 U","fischer","šroubovací",0.5,60,"02/0019","B","plná vápenopísková cihla",1.6,12,null,1.5,null,"MW","povrchová","NE",2E-3]
["termoz 8 U_plná pálená cihla","termoz 8 U","fischer","šroubovací",0.5,60,"02/0019","B","plná pálená cihla",1.6,12,null,1.5,null,"MW","povrchová","NE",2E-3]
["termoz 8 U_vertikálně děrovaná vápenopísková cihla","termoz 8 U","fischer","šroubovací",0.5,60,"02/0019","C","vertikálně děrovaná vápenopísková cihla",1.4,12,null,0.75,null,"MW","povrchová","NE",2E-3]
["termoz 8 U_vertikálně děrovaná cihla s hliněným střepem","termoz 8 U","fischer","šroubovací",0.5,60,"02/0019","C","vertikálně děrovaná cihla s hliněným střepem",1.2,12,null,0.75,null,"MW","povrchová","NE",2E-3]
["termoz 8 U_dutinové tvárnice z lehčeného betonu","termoz 8 U","fischer","šroubovací",0.5,60,"02/0019","C","dutinové tvárnice z lehčeného betonu",0.5,2,null,0.4,null,"MW","povrchová","NE",2E-3]
["termoz 8 U_tvárnice z lehčeného betonu","termoz 8 U","fischer","šroubovací",0.5,60,"02/0019","C","tvárnice z lehčeného betonu",0.5,4,null,0.6,null,"MW","povrchová","NE",2E-3]
["termoz 8 U_pórobeton P2","termoz 8 U","fischer","šroubovací",0.5,60,"02/0019","E","pórobeton P2",0.35,2,null,0.5,null,"MW","povrchová","NE",2E-3]
["termoz 8 U_pórobeton P4","termoz 8 U","fischer","šroubovací",0.5,60,"02/0019","E","pórobeton P4",0.5,4,null,1.2,null,"MW","povrchová","NE",2E-3]
["termofix CF 8_beton C12/15","termofix CF 8","fischer","zatloukací",0.5,60,"07/0287","A","beton C12/15",null,null,null,0.6,null,"MW","povrchová","NE",2E-3]
["termofix CF 8_beton C16/20","termofix CF 8","fischer","zatloukací",0.5,60,"07/0287","A","beton C16/20",null,null,null,0.75,null,"MW","povrchová","NE",2E-3]
["termofix CF 8_beton C50/60","termofix CF 8","fischer","zatloukací",0.5,60,"07/0287","A","beton C50/60",null,null,null,0.9,null,"MW","povrchová","NE",2E-3]
["termofix CF 8_plná vápenopísková cihla","termofix CF 8","fischer","zatloukací",0.5,60,"07/0287","B","plná vápenopísková cihla",1.8,12,null,0.75,null,"MW","povrchová","NE",2E-3]
["termofix CF 8_plná pálená cihla","termofix CF 8","fischer","zatloukací",0.5,60,"07/0287","B","plná pálená cihla",2,12,null,0.9,null,"MW","povrchová","NE",2E-3]
["termofix CF 8_vertikálně děrovaná vápenopísková cihla","termofix CF 8","fischer","zatloukací",0.5,60,"07/0287","C","vertikálně děrovaná vápenopísková cihla",1.4,12,null,0.75,null,"MW","povrchová","NE",2E-3]
["termofix CF 8_vertikálně děrovaná cihla s hliněným střepem","termofix CF 8","fischer","zatloukací",0.5,60,"07/0287","C","vertikálně děrovaná cihla s hliněným střepem",1,12,null,0.6,null,"MW","povrchová","NE",2E-3]
{"$rows_left_out":302}
{"sheet":"rozmístěníhmoždinek","index":8,"n_rows":106,"n_cols":19,"rows_kept":106,"cut":false,"hidden":true,"merged":[]}
[]
[null,null,null,null,null,null,null,null,null,null,null,"Rozmístění pro desky 600x1000"]
[null,6,null,null,null,null,null,null,null,null,null,"ks/m²","–",6,8,10,12,14,16]
[null,null,null,null,null,null,null,null,null,null,null,"obrázek","–",{"$f":"CEILING(N3*600/500,2)","v":8},10,12,16,18,20]
[null,4]
[null,"ve"]
[null,"spárách"]
[]
[]
[null,8]
[]
[null,4]
[null,"ve"]
[null,"spárách"]
[]
[]
[null,10]
[]
[null,4]
[null,"ve"]
{"$rows_left_out":87}
{"sheet":"počtyhmoždinek","index":9,"n_rows":641,"n_cols":10,"rows_kept":641,"cut":false,"hidden":true,"merged":[]}
["index","index objektu","větrová oblast","kategorie terénu","výška objektu","třída únosnosti","hmoždinek na m²","hmoždinek na 1,2 m²",null,{"$f":"IF(RIGHT(myHmoždinka,8)=\"ecotwist\",TRUE,FALSE)","v":false}]
[{"$f":"B2&\"/\"&F2","v":"I;I;do 10/0,10"},{"$f":"C2&\";\"&D2&\";\"&E2","v":"I;I;do 10"},"I","I","do 10","0,10","–","–"]
["I;I;do 15/0,10","I;I;do 15","I",{"$f":"D2","v":"I"},"do 15",{"$f":"F2","v":"0,10"},"–","–"]
["I;I;do 25/0,10","I;I;do 25","I",{"$f":"D3","v":"I"},"do 25","0,10","–","–"]
["I;I;do 38/0,10","I;I;do 38","I",{"$f":"D4","v":"I"},"do 38","0,10","–","–"]
["I;II;do 10/0,10","I;II;do 10","I","II","do 10","0,10",{"$f":"IF(ecotwist,\"–\",16)","v":16},"–"]
["I;II;do 15/0,10","I;II;do 15","I",{"$f":"D6","v":"II"},"do 15","0,10","–","–"]
["I;II;do 25/0,10","I;II;do 25","I",{"$f":"D7","v":"II"},"do 25","0,10","–","–"]
["I;II;do 38/0,10","I;II;do 38","I",{"$f":"D8","v":"II"},"do 38","0,10","–","–"]
["I;III;do 10/0,10","I;III;do 10","I","III","do 10","0,10",12,{"$f":"IF(ecotwist,\"–\",14)","v":14}]
["I;III;do 15/0,10","I;III;do 15","I",{"$f":"D10","v":"III"},"do 15","0,10",{"$f":"IF(ecotwist,\"–\",14)","v":14},{"$f":"IF(ecotwist,\"–\",16)","v":16}]
["I;III;do 25/0,10","I;III;do 25","I",{"$f":"D11","v":"III"},"do 25","0,10",{"$f":"IF(ecotwist,\"–\",16)","v":16},"–"]
["I;III;do 38/0,10","I;III;do 38","I",{"$f":"D12","v":"III"},"do 38","0,10","–","–"]
["I;IV;do 10/0,10","I;IV;do 10","I","IV","do 10","0,10",8,10]
["I;IV;do 15/0,10","I;IV;do 15","I",{"$f":"D14","v":"IV"},"do 15","0,10",10,12]
["I;IV;do 25/0,10","I;IV;do 25","I",{"$f":"D15","v":"IV"},"do 25","0,10",{"$f":"IF(ecotwist,\"–\",14)","v":14},{"$f":"IF(ecotwist,\"–\",16)","v":16}]
["I;IV;do 38/0,10","I;IV;do 38","I",{"$f":"D16","v":"IV"},"do 38","0,10",{"$f":"IF(ecotwist,\"–\",14)","v":14},"–"]
["I;I;do 10/0,12","I;I;do 10","I","I","do 10","0,12","–","–"]
["I;I;do 15/0,12","I;I;do 15","I",{"$f":"D18","v":"I"},"do 15",{"$f":"F18","v":"0,12"},"–","–"]
["I;I;do 25/0,12","I;I;do 25","I",{"$f":"D19","v":"I"},"do 25","0,12","–","–"]
{"$rows_left_out":622}
{"sheet":"param","index":10,"n_rows":79,"n_cols":25,"rows_kept":79,"cut":false,"hidden":true,"merged":[[2,24,3,25],[78,9,78,19],[3,15,3,18],[3,19,3,20],[75,9,75,19],[74,9,74,19],[77,9,77,19],[76,9,76,20]]}
["n","Podkladní materiál","Kat.","a","b",null,"n","Izolant","gMb","Rpanel,sm","Rjoint,sm","Rd,hm","Třída",null,"Třída","0,10","0,12","0,15","0,20","0,25","0,30","0,40","0,50",null,"SKRYTÉ VOLBY:"]
[1,"beton prostý nebo vyztužený třídy C 12/15 až 50/60","A",1.5,2.1,null,1,"minerální vlna FRONTROCK MAX E",1.5,0.25,0.18,{"$f":"kotvení*J2/I2","v":0.11333333333333334},{"$f":"INDEX($P$1:$W$1,1,MATCH(L2,$P$2:$W$2))","v":"0,10"},"MW","Rd,hm >",0.1,0.115,0.14000000000000001,0.19,0.24,0.28999999999999998,0.39,0.49]
[2,"plné cihly nebo kámen","B",2.1,2.9,null,2,"minerální vlna Nobasil FKD S",1.5,0.25,0.18,0.11333333333333334,"0,10","MW","Rd,hm ≤ ",0.115,0.14000000000000001,0.19,0.24,0.28999999999999998,0.39,0.49,"–",null,"ZPŮSOB KOTVENÍ"]
[3,"duté nebo děrované cihly nebo tvárnice","C",1.8,2.5,null,3,"minerální vlna Isover TF profi",1.5,0.25,0.18,0.11333333333333334,"0,10","MW","Min.tuhost","0,30",null,null,null,"0,40",null,"0,50","0,70"]
[4,"beton z pórovitého kameniva třídy LAC 2 až 25","D",2.4,3.2,null,4,"minerální vlna FASROCK",1.2,0.25,0.18,0.14166666666666669,"0,15","MW","talířku c"]
[5,"autoklávový pórobeton třídy P 2 až 7","E",1.8,2.5,null,5,"pěnový polystyrén 70F",1.2,0.25,0.18,0.14166666666666669,"0,15","EPS"]
[6,"betonová vrstva sendvičových panelů min. 50 mm","–",1.6,2.2999999999999998,null,6,"minerální vlna Nobasil FKD N",1.5,0.25,0.18,0.11333333333333334,"0,10","MW"]
[7,"deskové materiály","–",1.8,2.5,null,7,"minerální vlna Isover TF hobby",1.5,0.25,0.18,0.11333333333333334,"0,10","MW"]
[null,null,null,null,null,null,8,"fenolická pěna",2.2000000000000002,0.38,0.28000000000000003,0.11745454545454545,"0,12","PF",null,null,null,null,null,null,null,null,null,null,"verze:"]
[8,"jiný podkladní materiál","–",2.4,3.2,null,null,null,null,null,null,null,null,null,null,null,null,null,null,null,null,null,null,null,"3.05"]
[null,null,null,null,null,null,null,null,null,null,null,null,null,null,null,null,null,null,null,null,null,null,null,null,"ROCKWOOL"]
[null,null,null,null,null,null,"x","izolant","montáž","hmoždinka","talířek","Rpanel","Rd,hm","Třída"]
[null,null,null,null,null,null,{"$f":"H13&I13&J13&IF(K13>0,\"A\",\"N\")","v":"minerální vlna FRONTROCK MAX EpovrchováPTH-EXA"},"minerální vlna FRONTROCK MAX E","povrchová","PTH-EX",100,0.67,{"$f":"0.68*L13/VLOOKUP(H13,$H$1:$M$9,2,)","v":0.30373333333333336},{"$f":"INDEX($P$1:$W$1,1,MATCH(M13,$P$2:$W$2))","v":"0,30"},"Bravoll"]
[null,null,null,null,null,null,"minerální vlna FRONTROCK MAX EpovrchováPTH-EXN","minerální vlna FRONTROCK MAX E","povrchová","PTH-EX",0,0.41,0.18586666666666665,"0,15","Bravoll"]
[null,null,null,null,null,null,"minerální vlna FRONTROCK MAX EpovrchováPTH-KZA","minerální vlna FRONTROCK MAX E","povrchová","PTH-KZ",100,0.67,0.30373333333333336,"0,30","Bravoll"]
["n","Podkladní materiál","Kat.","a","b",null,"minerální vlna FRONTROCK MAX EpovrchováPTH-KZN","minerální vlna FRONTROCK MAX E","povrchová","PTH-KZ",0,0.41,0.18586666666666665,"0,15","Bravoll"]
[1,"(A) beton","A",1.5,2.1,null,"minerální vlna FRONTROCK MAX EpovrchováPTH-SA","minerální vlna FRONTROCK MAX E","povrchová","PTH-S",100,0.67,0.30373333333333336,"0,30","Bravoll"]
[2,"(B) plná pálená cihla","B",2.1,2.9,null,"minerální vlna FRONTROCK MAX EpovrchováPTH-SN","minerální vlna FRONTROCK MAX E","povrchová","PTH-S",0,0.41,0.18586666666666665,"0,15","Bravoll"]
[3,"(B) plná tvárnice z lehčeného betonu","B",2.1,2.9,null,"minerální vlna FRONTROCK MAX EpovrchováH1 ecoA","minerální vlna FRONTROCK MAX E","povrchová","H1 eco",90,0.57999999999999996,0.26293333333333335,"0,25","Ejot"]
[4,"(B) vápenopísková cihla","B",2.1,2.9,null,"minerální vlna FRONTROCK MAX EpovrchováH1 ecoN","minerální vlna FRONTROCK MAX E","povrchová","H1 eco",0,0.49,0.22213333333333332,"0,20","Ejot"]
{"$rows_left_out":59}